BDBM371755 (S)-N-(6-fluoropyridin-2-yl)-4-(2-(((S)-tetrahydrofuran-3-yl)oxy)-4-(trifluoromethyl)phenyl)chroman-7-sulfonamide::US10239869, Example 181
SMILES: Fc1cccc(NS(=O)(=O)c2ccc3[C@H](CCOc3c2)c2ccc(cc2O[C@H]2CCOC2)C(F)(F)F)n1
InChI Key: InChIKey=JBKHFEPGILUJSA-WMZOPIPTSA-N
Data: 1 IC50
Activity Spreadsheet -- Enzyme Inhibition Constant Data from BindingDB
Found 1 hit for monomerid = 371755
Trg + Lig
Ki
nM
ΔG°
kcal/mole
IC50
nM
Kd
nM
EC50/IC50
nM
koff
s-1
kon
M-1s-1
pHTemp
°C
Sodium channel protein type 9 subunit alpha
(Homo sapiens (Human))
BDBM371755
((S)-N-(6-fluoropyridin-2-yl)-4-(2-(((S)-tetrahydro...)
Show SMILES Fc1cccc(NS(=O)(=O)c2ccc3[C@H](CCOc3c2)c2ccc(cc2O[C@H]2CCOC2)C(F)(F)F)n1
Show InChI InChI=1S/C25H22F4N2O5S/c26-23-2-1-3-24(30-23)31-37(32,33)17-5-7-19-18(9-11-35-21(19)13-17)20-6-4-15(25(27,28)29)12-22(20)36-16-8-10-34-14-16/h1-7,12-13,16,18H,8-11,14H2,(H,30,31)/t16-,18-/m0/s1
US Patent
n/an/a 0.900n/an/an/an/an/an/a
University of California at San Francisco
Assay Description
HEK-293 cells overexpressing the channel of interest were seeded in a 96-well plate at a density of 30000 cells/well and incubated at 37° C./5% CO2 f...
J Med Chem 51: 545-52 (2008)
BindingDB Entry DOI: 10.7270/Q2NG4SZX