BDBM371768 (R)-4-(2-(5-fluoropyridin-2-yl)-4-(trifluoromethyl)phenyl)-N-(pyrimidin-2-yl)chroman-7-sulfonamide::US10239869, Example 194
SMILES: Fc1ccc(nc1)-c1cc(ccc1[C@H]1CCOc2cc(ccc12)S(=O)(=O)Nc1ncccn1)C(F)(F)F
InChI Key: InChIKey=ITMUKFCZWABNED-LJQANCHMSA-N
Data: 2 IC50
Activity Spreadsheet -- Enzyme Inhibition Constant Data from BindingDB
Found 2 hits for monomerid = 371768
Trg + Lig
Ki
nM
ΔG°
kcal/mole
IC50
nM
Kd
nM
EC50/IC50
nM
koff
s-1
kon
M-1s-1
pHTemp
°C
Sodium channel protein type 9 subunit alpha
(Homo sapiens (Human))
BDBM371768
((R)-4-(2-(5-fluoropyridin-2-yl)-4-(trifluoromethyl...)
Show SMILES Fc1ccc(nc1)-c1cc(ccc1[C@H]1CCOc2cc(ccc12)S(=O)(=O)Nc1ncccn1)C(F)(F)F
Show InChI InChI=1S/C25H18F4N4O3S/c26-16-3-7-22(32-14-16)21-12-15(25(27,28)29)2-5-18(21)19-8-11-36-23-13-17(4-6-20(19)23)37(34,35)33-24-30-9-1-10-31-24/h1-7,9-10,12-14,19H,8,11H2,(H,30,31,33)/t19-/m1/s1
n/an/a 2.70n/an/an/an/an/an/a
Lupin Ltd.
Curated by ChEMBL
Assay Description
Inhibition of Nav1.7 (unknown origin) expressed in HEK293 cells assessed as reduction in veratridine-induced depolarization preincubated for 15 to 20...
J Med Chem 63: 6107-6133 (2020)
Sodium channel protein type 9 subunit alpha
(Homo sapiens (Human))
BDBM371768
((R)-4-(2-(5-fluoropyridin-2-yl)-4-(trifluoromethyl...)
Show SMILES Fc1ccc(nc1)-c1cc(ccc1[C@H]1CCOc2cc(ccc12)S(=O)(=O)Nc1ncccn1)C(F)(F)F
Show InChI InChI=1S/C25H18F4N4O3S/c26-16-3-7-22(32-14-16)21-12-15(25(27,28)29)2-5-18(21)19-8-11-36-23-13-17(4-6-20(19)23)37(34,35)33-24-30-9-1-10-31-24/h1-7,9-10,12-14,19H,8,11H2,(H,30,31,33)/t19-/m1/s1
US Patent
n/an/a 1n/an/an/an/an/an/a
University of California at San Francisco
Assay Description
HEK-293 cells overexpressing the channel of interest were seeded in a 96-well plate at a density of 30000 cells/well and incubated at 37° C./5% CO2 f...
J Med Chem 51: 545-52 (2008)
BindingDB Entry DOI: 10.7270/Q2NG4SZX