BDBM371774 (R)-4-(2-(5-fluoropyridin-2-yl)-4-(trifluoromethyl)phenyl)-N-(pyridazin-3-yl)chroman-7-sulfonamide::US10239869, Example 200
SMILES: Fc1ccc(nc1)-c1cc(ccc1[C@H]1CCOc2cc(ccc12)S(=O)(=O)Nc1cccnn1)C(F)(F)F
InChI Key: InChIKey=DAVNSKGDQYFIMM-LJQANCHMSA-N
Data: 2 IC50
Activity Spreadsheet -- Enzyme Inhibition Constant Data from BindingDB
Found 2 hits for monomerid = 371774
Trg + Lig
Ki
nM
ΔG°
kcal/mole
IC50
nM
Kd
nM
EC50/IC50
nM
koff
s-1
kon
M-1s-1
pHTemp
°C
Sodium channel protein type 5 subunit alpha
(Homo sapiens (Human))
BDBM371774
((R)-4-(2-(5-fluoropyridin-2-yl)-4-(trifluoromethyl...)
Show SMILES Fc1ccc(nc1)-c1cc(ccc1[C@H]1CCOc2cc(ccc12)S(=O)(=O)Nc1cccnn1)C(F)(F)F
Show InChI InChI=1S/C25H18F4N4O3S/c26-16-4-8-22(30-14-16)21-12-15(25(27,28)29)3-6-18(21)19-9-11-36-23-13-17(5-7-20(19)23)37(34,35)33-24-2-1-10-31-32-24/h1-8,10,12-14,19H,9,11H2,(H,32,33)/t19-/m1/s1
US Patent
n/an/a>1.00E+4n/an/an/an/an/an/a
University of California at San Francisco
Assay Description
HEK-293 cells overexpressing the channel of interest were seeded in a 96-well plate at a density of 30000 cells/well and incubated at 37° C./5% CO2 f...
J Med Chem 51: 545-52 (2008)
BindingDB Entry DOI: 10.7270/Q2NG4SZX
Sodium channel protein type 9 subunit alpha
(Homo sapiens (Human))
BDBM371774
((R)-4-(2-(5-fluoropyridin-2-yl)-4-(trifluoromethyl...)
Show SMILES Fc1ccc(nc1)-c1cc(ccc1[C@H]1CCOc2cc(ccc12)S(=O)(=O)Nc1cccnn1)C(F)(F)F
Show InChI InChI=1S/C25H18F4N4O3S/c26-16-4-8-22(30-14-16)21-12-15(25(27,28)29)3-6-18(21)19-9-11-36-23-13-17(5-7-20(19)23)37(34,35)33-24-2-1-10-31-32-24/h1-8,10,12-14,19H,9,11H2,(H,32,33)/t19-/m1/s1
US Patent
n/an/a 0.5n/an/an/an/an/an/a
University of California at San Francisco
Assay Description
HEK-293 cells overexpressing the channel of interest were seeded in a 96-well plate at a density of 30000 cells/well and incubated at 37° C./5% CO2 f...
J Med Chem 51: 545-52 (2008)
BindingDB Entry DOI: 10.7270/Q2NG4SZX