null
SMILES: FC1(F)CCN(C1)C(=O)CN1CN(c2ccccc2)C2(CCN(CC2)C(=O)c2cnc3[nH]ncc3c2)C1=O
InChI Key: InChIKey=WSOOEDMRKNRFBS-UHFFFAOYSA-N
Activity Spreadsheet -- Enzyme Inhibition Constant Data from BindingDB
Found 2 hits for monomerid = 372045
Trg + Lig
Ki
nM
ΔG°
kcal/mole
IC50
nM
Kd
nM
EC50/IC50
nM
koff
s-1
kon
M-1s-1
pHTemp
°C
Epithelial discoidin domain-containing receptor 1
(Homo sapiens (Human))
BDBM372045
(3-[2-(3,3-Difluoropyrrolidin-1-yl)-2-oxoethyl]-1-p...)
Show SMILES FC1(F)CCN(C1)C(=O)CN1CN(c2ccccc2)C2(CCN(CC2)C(=O)c2cnc3[nH]ncc3c2)C1=O
Show InChI InChI=1S/C26H27F2N7O3/c27-26(28)8-11-33(16-26)21(36)15-34-17-35(20-4-2-1-3-5-20)25(24(34)38)6-9-32(10-7-25)23(37)19-12-18-14-30-31-22(18)29-13-19/h1-5,12-14H,6-11,15-17H2,(H,29,30,31)
US Patent
n/an/a 19.1n/an/an/an/an/an/a
Hoffmann-La Roche Inc.
US Patent
Assay Description
This assay is based on the intracellular domain of the DDR1 protein which contains the kinase active site. The recombinant protein additionally carri...
US Patent US10435407 (2019)
BindingDB Entry DOI: 10.7270/Q2MP55M4
D(1A) dopamine receptor
(Homo sapiens (Human))
BDBM372045
(3-[2-(3,3-Difluoropyrrolidin-1-yl)-2-oxoethyl]-1-p...)
Show SMILES FC1(F)CCN(C1)C(=O)CN1CN(c2ccccc2)C2(CCN(CC2)C(=O)c2cnc3[nH]ncc3c2)C1=O
Show InChI InChI=1S/C26H27F2N7O3/c27-26(28)8-11-33(16-26)21(36)15-34-17-35(20-4-2-1-3-5-20)25(24(34)38)6-9-32(10-7-25)23(37)19-12-18-14-30-31-22(18)29-13-19/h1-5,12-14H,6-11,15-17H2,(H,29,30,31)
US Patent
n/an/a 19.1n/an/an/an/an/an/a
Georgia Institute of Technology
Assay Description
This assay is based on the intracellular domain of the DDR1 protein which contains the kinase active site. The recombinant protein additionally carri...
J Med Chem 51: 2816-32 (2008)
BindingDB Entry DOI: 10.7270/Q2D220ZB