BDBM372102 2-(1-(3-Chlorophenyl)-4-oxo-8-(1H-pyrazolo[3,4-b]pyridine-5-carbonyl)-1,3,8-triazaspiro[4.5]decan-3-yl)-N-(2,2,2-trifluoroethyl)acetamide::US10239876, Example 125::US10435407, Example 125
SMILES: FC(F)(F)CNC(=O)CN1CN(c2cccc(Cl)c2)C2(CCN(CC2)C(=O)c2cnc3[nH]ncc3c2)C1=O
InChI Key: InChIKey=VNRGGLUPXIJJDG-UHFFFAOYSA-N
Data: 2 IC50
Activity Spreadsheet -- Enzyme Inhibition Constant Data from BindingDB
Found 2 hits for monomerid = 372102
Trg + Lig
Ki
nM
ΔG°
kcal/mole
IC50
nM
Kd
nM
EC50/IC50
nM
koff
s-1
kon
M-1s-1
pHTemp
°C
Epithelial discoidin domain-containing receptor 1
(Homo sapiens (Human))
BDBM372102
(2-(1-(3-Chlorophenyl)-4-oxo-8-(1H-pyrazolo[3,4-b]p...)
Show SMILES FC(F)(F)CNC(=O)CN1CN(c2cccc(Cl)c2)C2(CCN(CC2)C(=O)c2cnc3[nH]ncc3c2)C1=O
Show InChI InChI=1S/C24H23ClF3N7O3/c25-17-2-1-3-18(9-17)35-14-34(12-19(36)30-13-24(26,27)28)22(38)23(35)4-6-33(7-5-23)21(37)16-8-15-11-31-32-20(15)29-10-16/h1-3,8-11H,4-7,12-14H2,(H,30,36)(H,29,31,32)
US Patent
n/an/a 12.9n/an/an/an/an/an/a
Hoffmann-La Roche Inc.
US Patent
Assay Description
This assay is based on the intracellular domain of the DDR1 protein which contains the kinase active site. The recombinant protein additionally carri...
US Patent US10435407 (2019)
BindingDB Entry DOI: 10.7270/Q2MP55M4
D(1A) dopamine receptor
(Homo sapiens (Human))
BDBM372102
(2-(1-(3-Chlorophenyl)-4-oxo-8-(1H-pyrazolo[3,4-b]p...)
Show SMILES FC(F)(F)CNC(=O)CN1CN(c2cccc(Cl)c2)C2(CCN(CC2)C(=O)c2cnc3[nH]ncc3c2)C1=O
Show InChI InChI=1S/C24H23ClF3N7O3/c25-17-2-1-3-18(9-17)35-14-34(12-19(36)30-13-24(26,27)28)22(38)23(35)4-6-33(7-5-23)21(37)16-8-15-11-31-32-20(15)29-10-16/h1-3,8-11H,4-7,12-14H2,(H,30,36)(H,29,31,32)
US Patent
n/an/a 12.9n/an/an/an/an/an/a
Georgia Institute of Technology
Assay Description
This assay is based on the intracellular domain of the DDR1 protein which contains the kinase active site. The recombinant protein additionally carri...
J Med Chem 51: 2816-32 (2008)
BindingDB Entry DOI: 10.7270/Q2D220ZB