null
SMILES: O=C(CN1CN(c2ccccc2)C2(CCN(CC2)C(=O)c2cnc3[nH]ncc3c2)C1=O)Nc1ccccc1CN1CCOCC1
InChI Key: InChIKey=JBODBRVQXUEXLM-UHFFFAOYSA-N
Activity Spreadsheet -- Enzyme Inhibition Constant Data from BindingDB
Found 2 hits for monomerid = 372114
Trg + Lig
Ki
nM
ΔG°
kcal/mole
IC50
nM
Kd
nM
EC50/IC50
nM
koff
s-1
kon
M-1s-1
pHTemp
°C
Epithelial discoidin domain-containing receptor 1
(Homo sapiens (Human))
BDBM372114
(N-(2-(Morpholinomethyl)phenyl)-2-(4-oxo-1-phenyl-8...)
Show SMILES O=C(CN1CN(c2ccccc2)C2(CCN(CC2)C(=O)c2cnc3[nH]ncc3c2)C1=O)Nc1ccccc1CN1CCOCC1
Show InChI InChI=1S/C33H36N8O4/c42-29(36-28-9-5-4-6-24(28)21-38-14-16-45-17-15-38)22-40-23-41(27-7-2-1-3-8-27)33(32(40)44)10-12-39(13-11-33)31(43)26-18-25-20-35-37-30(25)34-19-26/h1-9,18-20H,10-17,21-23H2,(H,36,42)(H,34,35,37)
US Patent
n/an/a 23.1n/an/an/an/an/an/a
Hoffmann-La Roche Inc.
US Patent
Assay Description
This assay is based on the intracellular domain of the DDR1 protein which contains the kinase active site. The recombinant protein additionally carri...
US Patent US10435407 (2019)
BindingDB Entry DOI: 10.7270/Q2MP55M4
D(1A) dopamine receptor
(Homo sapiens (Human))
BDBM372114
(N-(2-(Morpholinomethyl)phenyl)-2-(4-oxo-1-phenyl-8...)
Show SMILES O=C(CN1CN(c2ccccc2)C2(CCN(CC2)C(=O)c2cnc3[nH]ncc3c2)C1=O)Nc1ccccc1CN1CCOCC1
Show InChI InChI=1S/C33H36N8O4/c42-29(36-28-9-5-4-6-24(28)21-38-14-16-45-17-15-38)22-40-23-41(27-7-2-1-3-8-27)33(32(40)44)10-12-39(13-11-33)31(43)26-18-25-20-35-37-30(25)34-19-26/h1-9,18-20H,10-17,21-23H2,(H,36,42)(H,34,35,37)
US Patent
n/an/a 23.1n/an/an/an/an/an/a
Georgia Institute of Technology
Assay Description
This assay is based on the intracellular domain of the DDR1 protein which contains the kinase active site. The recombinant protein additionally carri...
J Med Chem 51: 2816-32 (2008)
BindingDB Entry DOI: 10.7270/Q2D220ZB