BDBM372154 N-(3- (morpholino- methyl)phenyl)- 6-(o-tolyl)- 5H-pyrrolo[3,2-d] pyrimidin-2-amine::US10239881, Example A7::US10875863, Example A7
SMILES: Cc1ccccc1-c1cc2nc(Nc3cccc(CN4CCOCC4)c3)ncc2[nH]1
InChI Key: InChIKey=ZAFUBDJXOIHYNU-UHFFFAOYSA-N
Data: 2 IC50
Activity Spreadsheet -- Enzyme Inhibition Constant Data from BindingDB
Found 2 hits for monomerid = 372154
Trg + Lig
Ki
nM
ΔG°
kcal/mole
IC50
nM
Kd
nM
EC50/IC50
nM
koff
s-1
kon
M-1s-1
pHTemp
°C
Serine/threonine-protein kinase RIPK2
(Homo sapiens (Human))
BDBM372154
(N-(3- (morpholino- methyl)phenyl)- 6-(o-tolyl)- 5H...)
Show SMILES Cc1ccccc1-c1cc2nc(Nc3cccc(CN4CCOCC4)c3)ncc2[nH]1
Show InChI InChI=1S/C24H25N5O/c1-17-5-2-3-8-20(17)21-14-22-23(27-21)15-25-24(28-22)26-19-7-4-6-18(13-19)16-29-9-11-30-12-10-29/h2-8,13-15,27H,9-12,16H2,1H3,(H,25,26,28)
US Patent
n/an/a<100n/an/an/an/an/an/a
UNIVERSITY HEALTH NETWORK
US Patent
Assay Description
Active RIPK2 was purchased from Life Technologies as His-tagged of catalytic domain (amin acids 1-299) of human RIPK2 kinase expressed in insect cell...
US Patent US10875863 (2020)
Serine/threonine-protein kinase RIPK2
(Homo sapiens (Human))
BDBM372154
(N-(3- (morpholino- methyl)phenyl)- 6-(o-tolyl)- 5H...)
Show SMILES Cc1ccccc1-c1cc2nc(Nc3cccc(CN4CCOCC4)c3)ncc2[nH]1
Show InChI InChI=1S/C24H25N5O/c1-17-5-2-3-8-20(17)21-14-22-23(27-21)15-25-24(28-22)26-19-7-4-6-18(13-19)16-29-9-11-30-12-10-29/h2-8,13-15,27H,9-12,16H2,1H3,(H,25,26,28)
US Patent
n/an/a<100n/an/an/an/an/an/a
National Taiwan University
Assay Description
RIPK2 activity was measured using an indirect ELISA detection system. His—RIPK2 (0.6 nM) was incubated in the presence of 6 μM ATP (Sigma cat # ...
J Med Chem 51: 2795-806 (2008)
BindingDB Entry DOI: 10.7270/Q289186K