BDBM372357 Preparation of (R)-4-((1R,3aS,5aR,5bR,7aR,11aS,11bR,13aR,13bR)-3a-((2-(4,4-bis(ethoxycarbonyl)piperidin-1-yl)ethyl)amino)-5a,5b, 8,8,11a-pentamethyl-1-(prop-1-en-2-yl)-2,3,3a,4,5,5a,5b,6,7,7a,8,11,11a,11b,12,13,13a,13b-octadecahydro-1H-cyclopenta[a]chrysen-9-yl)-1-(fluoromethyl)cyclohex-3-enecarboxylic acid::US10245275, Example 13
SMILES: CCOC(=O)C1(CCN(CCN[C@]23CC[C@H]([C@@H]2[C@H]2CC[C@@H]4[C@@]5(C)CC=C(C6=CC[C@](CF)(CC6)C(O)=O)C(C)(C)[C@@H]5CC[C@@]4(C)[C@]2(C)CC3)C(C)=C)CC1)C(=O)OCC
InChI Key: InChIKey=BAWSXLZBJDNNLM-GBDPANAQSA-N
Data: 2 EC50
Activity Spreadsheet -- Enzyme Inhibition Constant Data from BindingDB
Found 2 hits for monomerid = 372357
Trg + Lig
Ki
nM
ΔG°
kcal/mole
IC50
nM
Kd
nM
EC50/IC50
nM
koff
s-1
kon
M-1s-1
pHTemp
°C
HIV-1 gap A364V
(Human immunodeficiency virus type 1 group M subtyp...)
BDBM372357
(Preparation of (R)-4-((1R,3aS,5aR,5bR,7aR,11aS,11b...)
Show SMILES CCOC(=O)C1(CCN(CCN[C@]23CC[C@H]([C@@H]2[C@H]2CC[C@@H]4[C@@]5(C)CC=C(C6=CC[C@](CF)(CC6)C(O)=O)C(C)(C)[C@@H]5CC[C@@]4(C)[C@]2(C)CC3)C(C)=C)CC1)C(=O)OCC |r,t:25,27|
Show InChI InChI=1S/C50H77FN2O6/c1-10-58-42(56)49(43(57)59-11-2)26-29-53(30-27-49)31-28-52-50-23-16-35(33(3)4)40(50)37-12-13-39-45(7)19-17-36(34-14-21-48(32-51,22-15-34)41(54)55)44(5,6)38(45)18-20-47(39,9)46(37,8)24-25-50/h14,17,35,37-40,52H,3,10-13,15-16,18-32H2,1-2,4-9H3,(H,54,55)/t35-,37+,38-,39+,40+,45-,46+,47+,48+,50-/m0/s1
US Patent
n/an/an/an/a 196n/an/an/an/a
Bristol-Myers Squibb Company
Assay Description
MT-2 cells and 293T cells were obtained from the NIH AIDS Research and Reference Reagent Program. MT-2 cells were propagated in RPMI 1640 media suppl...
Bioorg Med Chem Lett 15: 1435-40 (2005)
BindingDB Entry DOI: 10.7270/Q2MK6G6T
Gag-Pol polyprotein (Capsid Protein)
(Human immunodeficiency virus type 1 group M subtyp...)
BDBM372357
(Preparation of (R)-4-((1R,3aS,5aR,5bR,7aR,11aS,11b...)
Show SMILES CCOC(=O)C1(CCN(CCN[C@]23CC[C@H]([C@@H]2[C@H]2CC[C@@H]4[C@@]5(C)CC=C(C6=CC[C@](CF)(CC6)C(O)=O)C(C)(C)[C@@H]5CC[C@@]4(C)[C@]2(C)CC3)C(C)=C)CC1)C(=O)OCC |r,t:25,27|
Show InChI InChI=1S/C50H77FN2O6/c1-10-58-42(56)49(43(57)59-11-2)26-29-53(30-27-49)31-28-52-50-23-16-35(33(3)4)40(50)37-12-13-39-45(7)19-17-36(34-14-21-48(32-51,22-15-34)41(54)55)44(5,6)38(45)18-20-47(39,9)46(37,8)24-25-50/h14,17,35,37-40,52H,3,10-13,15-16,18-32H2,1-2,4-9H3,(H,54,55)/t35-,37+,38-,39+,40+,45-,46+,47+,48+,50-/m0/s1
US Patent
n/an/an/an/a 18.8n/an/an/an/a
Bristol-Myers Squibb Company
Assay Description
MT-2 cells and 293T cells were obtained from the NIH AIDS Research and Reference Reagent Program. MT-2 cells were propagated in RPMI 1640 media suppl...
Bioorg Med Chem Lett 15: 1435-40 (2005)
BindingDB Entry DOI: 10.7270/Q2MK6G6T