BDBM3740 US8530670, 27
SMILES: O=C1C=C(C(N1c1ccc2nc[nH]c2c1)c1ccc(cc1)N1CCOCC1)N1CCCCC1
InChI Key: InChIKey=ZGMJMJGEMCIZHE-UHFFFAOYSA-N
Data: 1 KI  1 IC50
Activity Spreadsheet -- Enzyme Inhibition Constant Data from BindingDB
Found 1 hit for monomerid = 3740
Trg + Lig
Ki
nM
ΔG°
kcal/mole
IC50
nM
Kd
nM
EC50/IC50
nM
koff
s-1
kon
M-1s-1
pHTemp
°C
Glutaminyl Cyclase
(Homo sapiens (Human))
BDBM3740
(US8530670, 27)
Show SMILES O=C1C=C(C(N1c1ccc2nc[nH]c2c1)c1ccc(cc1)N1CCOCC1)N1CCCCC1 |c:2|
Show InChI InChI=1S/C26H29N5O2/c32-25-17-24(30-10-2-1-3-11-30)26(31(25)21-8-9-22-23(16-21)28-18-27-22)19-4-6-20(7-5-19)29-12-14-33-15-13-29/h4-9,16-18,26H,1-3,10-15H2,(H,27,28)
US Patent
4.60 -11.6 46.1n/an/an/an/an/a30
Probiodrug AG
US Patent
Assay Description
This novel assay was used to determine the kinetic parameters for most of the QC substrate. QC activity was analyzed spectrophotometrically using a ...
US Patent US8530670 (2013)
BindingDB Entry DOI: 10.7270/Q2PK0DTD