BDBM37533 (2E,4S,4aS,5aS,6S,12aS)-2-[amino(hydroxy)methylene]-7-chloro-4-(dimethylamino)-6,10,11,12a-tetrahydroxy-4a,5,5a,6-tetrahydro-4H-tetracene-1,3,12-trione;hydrochloride::(2E,4S,4aS,5aS,6S,12aS)-2-[amino(hydroxy)methylidene]-7-chloro-4-(dimethylamino)-6,10,11,12a-tetrahydroxy-4a,5,5a,6-tetrahydro-4H-tetracene-1,3,12-trione;hydrochloride::(2E,4S,4aS,5aS,6S,12aS)-2-[azanyl(oxidanyl)methylidene]-7-chloranyl-4-(dimethylamino)-6,10,11,12a-tetrakis(oxidanyl)-4a,5,5a,6-tetrahydro-4H-tetracene-1,3,12-trione;hydrochloride::7-CHLORO-6-DEMETHYLTETRACYCLINE HYDROCHLORIDE::MLS000028422::SMR000058439::cid_6602612
SMILES: CN(C)[C@H]1[C@@H]2C[C@@H]3[C@H](O)c4c(Cl)ccc(O)c4C(=O)C3C(=O)[C@]2(O)C(=O)C(C(N)=O)C1=O
InChI Key: InChIKey=JHOHXJYRVSLQCB-AMESULRKSA-N
Data: 2 IC50
Activity Spreadsheet -- Enzyme Inhibition Constant Data from BindingDB
Found 2 hits for monomerid = 37533
Trg + Lig
Ki
nM
ΔG°
kcal/mole
IC50
nM
Kd
nM
EC50/IC50
nM
koff
s-1
kon
M-1s-1
pHTemp
°C
Estrogen receptor beta
(Homo sapiens (Human))
BDBM37533
((2E,4S,4aS,5aS,6S,12aS)-2-[amino(hydroxy)methylene...)
Show SMILES CN(C)[C@H]1[C@@H]2C[C@@H]3[C@H](O)c4c(Cl)ccc(O)c4C(=O)C3C(=O)[C@]2(O)C(=O)C(C(N)=O)C1=O
Show InChI InChI=1S/C21H21ClN2O8/c1-24(2)14-7-5-6-10(16(27)12-9(25)4-3-8(22)11(12)15(6)26)18(29)21(7,32)19(30)13(17(14)28)20(23)31/h3-4,6-7,10,13-15,25-26,32H,5H2,1-2H3,(H2,23,31)/t6-,7-,10?,13?,14-,15-,21-/m0/s1
PCBioAssay
n/an/a 61.4n/an/an/an/an/an/a
Emory University Molecular Libraries Screening Center
Curated by PubChem BioAssay
Assay Description
NIH Molecular Libraries Screening Centers Network [MLSCN] Emory Chemical Biology Discovery Center in MLSCN Assay provider: John A. Katzenellenbogen, ...
PubChem Bioassay (2008)
BindingDB Entry DOI: 10.7270/Q2CF9NHH
Huntingtin
(Homo sapiens (Human))
BDBM37533
((2E,4S,4aS,5aS,6S,12aS)-2-[amino(hydroxy)methylene...)
Show SMILES CN(C)[C@H]1[C@@H]2C[C@@H]3[C@H](O)c4c(Cl)ccc(O)c4C(=O)C3C(=O)[C@]2(O)C(=O)C(C(N)=O)C1=O
Show InChI InChI=1S/C21H21ClN2O8/c1-24(2)14-7-5-6-10(16(27)12-9(25)4-3-8(22)11(12)15(6)26)18(29)21(7,32)19(30)13(17(14)28)20(23)31/h3-4,6-7,10,13-15,25-26,32H,5H2,1-2H3,(H2,23,31)/t6-,7-,10?,13?,14-,15-,21-/m0/s1
PCBioAssay
n/an/a<10n/an/an/an/an/an/a
Columbia University Molecular Screening Center
Curated by PubChem BioAssay
Assay Description
The mutation underlying Huntington's disease is an expansion of a polyglutamine tract in the N-terminus of the protein huntingtin (htt). Under no...
PubChem Bioassay (2007)
BindingDB Entry DOI: 10.7270/Q2SQ8XSH