BDBM375964 US10947243, Example 41::US9914735, Example 41
SMILES: C[C@@H](Oc1cc(cc2nn(C)cc12)-c1ccc(F)cn1)[C@H]1CNC(=O)C1
InChI Key: InChIKey=AJHBYQLGRIOMIW-DGCLKSJQSA-N
Data: 22 IC50
Activity Spreadsheet -- Enzyme Inhibition Constant Data from BindingDB
Found 22 hits for monomerid = 375964
Trg + Lig
Ki
nM
ΔG°
kcal/mole
IC50
nM
Kd
nM
EC50/IC50
nM
koff
s-1
kon
M-1s-1
pHTemp
°C
Tyrosine-protein kinase SYK
(Homo sapiens (Human))
BDBM375964
(US10947243, Example 41 | US9914735, Example 41)
Show SMILES C[C@@H](Oc1cc(cc2nn(C)cc12)-c1ccc(F)cn1)[C@H]1CNC(=O)C1 |r|
Show InChI InChI=1S/C19H19FN4O2/c1-11(13-7-19(25)22-8-13)26-18-6-12(16-4-3-14(20)9-21-16)5-17-15(18)10-24(2)23-17/h3-6,9-11,13H,7-8H2,1-2H3,(H,22,25)/t11-,13-/m1/s1
NCI pathway
Reactome pathway
US Patent
n/an/a 164n/an/an/an/an/an/a
University of Namur
Assay Description
Recombinant human Syk (amino acids 342-635) was expressed as a fusion protein with an N-terminal GST tag, affinity-purified and deep-frozen at a conc...
J Med Chem 51: 3077-80 (2008)
BindingDB Entry DOI: 10.7270/Q21G0PJ6
Glycogen synthase kinase-3 beta
(Homo sapiens (Human))
BDBM375964
(US10947243, Example 41 | US9914735, Example 41)
Show SMILES C[C@@H](Oc1cc(cc2nn(C)cc12)-c1ccc(F)cn1)[C@H]1CNC(=O)C1 |r|
Show InChI InChI=1S/C19H19FN4O2/c1-11(13-7-19(25)22-8-13)26-18-6-12(16-4-3-14(20)9-21-16)5-17-15(18)10-24(2)23-17/h3-6,9-11,13H,7-8H2,1-2H3,(H,22,25)/t11-,13-/m1/s1
NCI pathway
Reactome pathway
US Patent
n/an/a>1.00E+4n/an/an/an/an/an/a
Boehringer Ingelheim International GmbH
US Patent
Assay Description
FLT3 is obtained from Invitrogen in 50 mM Tris (pH7.5); 100 mM NaCl; 0.05 mM EDTA, 0.05% NP-40, 2 mM DTT; 50% Glycerol # PV3182; Lot 286671; sequence...
US Patent US10947243 (2021)
Receptor-type tyrosine-protein kinase FLT3
(Homo sapiens (Human))
BDBM375964
(US10947243, Example 41 | US9914735, Example 41)
Show SMILES C[C@@H](Oc1cc(cc2nn(C)cc12)-c1ccc(F)cn1)[C@H]1CNC(=O)C1 |r|
Show InChI InChI=1S/C19H19FN4O2/c1-11(13-7-19(25)22-8-13)26-18-6-12(16-4-3-14(20)9-21-16)5-17-15(18)10-24(2)23-17/h3-6,9-11,13H,7-8H2,1-2H3,(H,22,25)/t11-,13-/m1/s1
US Patent
n/an/a 4.28E+4n/an/an/an/an/an/a
University of Namur
Assay Description
Recombinant human Syk (amino acids 342-635) was expressed as a fusion protein with an N-terminal GST tag, affinity-purified and deep-frozen at a conc...
J Med Chem 51: 3077-80 (2008)
BindingDB Entry DOI: 10.7270/Q21G0PJ6
Tyrosine-protein kinase SYK
(Homo sapiens (Human))
BDBM375964
(US10947243, Example 41 | US9914735, Example 41)
Show SMILES C[C@@H](Oc1cc(cc2nn(C)cc12)-c1ccc(F)cn1)[C@H]1CNC(=O)C1 |r|
Show InChI InChI=1S/C19H19FN4O2/c1-11(13-7-19(25)22-8-13)26-18-6-12(16-4-3-14(20)9-21-16)5-17-15(18)10-24(2)23-17/h3-6,9-11,13H,7-8H2,1-2H3,(H,22,25)/t11-,13-/m1/s1
NCI pathway
Reactome pathway
US Patent
n/an/a 1n/an/an/an/an/an/a
University of Namur
Assay Description
Human GSK3beta (expressed and prified from SF21 cells) is obtained from the University Dundee/Scotland (Dr. James Hastie—Dept. of Biochemistry) ...
J Med Chem 51: 3077-80 (2008)
BindingDB Entry DOI: 10.7270/Q21G0PJ6
Aurora kinase B
(Homo sapiens (Human))
BDBM375964
(US10947243, Example 41 | US9914735, Example 41)
Show SMILES C[C@@H](Oc1cc(cc2nn(C)cc12)-c1ccc(F)cn1)[C@H]1CNC(=O)C1 |r|
Show InChI InChI=1S/C19H19FN4O2/c1-11(13-7-19(25)22-8-13)26-18-6-12(16-4-3-14(20)9-21-16)5-17-15(18)10-24(2)23-17/h3-6,9-11,13H,7-8H2,1-2H3,(H,22,25)/t11-,13-/m1/s1
Reactome pathway
US Patent
n/an/a 308n/an/an/an/an/an/a
University of Namur
Assay Description
Recombinant human Aurora B (amino acids 1-344, clone number DU1773, Molecular weight 40.2 kDa, University of Dundee) was expressed as a fusion protei...
J Med Chem 51: 3077-80 (2008)
BindingDB Entry DOI: 10.7270/Q21G0PJ6
Receptor-type tyrosine-protein kinase FLT3
(Homo sapiens (Human))
BDBM375964
(US10947243, Example 41 | US9914735, Example 41)
Show SMILES C[C@@H](Oc1cc(cc2nn(C)cc12)-c1ccc(F)cn1)[C@H]1CNC(=O)C1 |r|
Show InChI InChI=1S/C19H19FN4O2/c1-11(13-7-19(25)22-8-13)26-18-6-12(16-4-3-14(20)9-21-16)5-17-15(18)10-24(2)23-17/h3-6,9-11,13H,7-8H2,1-2H3,(H,22,25)/t11-,13-/m1/s1
US Patent
n/an/a 505n/an/an/an/an/an/a
University of Namur
Assay Description
FLT3 is obtained from Invitrogen in 50 mM Tris (pH7.5); 100 mM NaCl; 0.05 mM EDTA, 0.05% NP-40, 2 mM DTT; 50% Glycerol # PV3182; Lot 286671; sequence...
J Med Chem 51: 3077-80 (2008)
BindingDB Entry DOI: 10.7270/Q21G0PJ6
Glycogen synthase kinase-3 beta
(Homo sapiens (Human))
BDBM375964
(US10947243, Example 41 | US9914735, Example 41)
Show SMILES C[C@@H](Oc1cc(cc2nn(C)cc12)-c1ccc(F)cn1)[C@H]1CNC(=O)C1 |r|
Show InChI InChI=1S/C19H19FN4O2/c1-11(13-7-19(25)22-8-13)26-18-6-12(16-4-3-14(20)9-21-16)5-17-15(18)10-24(2)23-17/h3-6,9-11,13H,7-8H2,1-2H3,(H,22,25)/t11-,13-/m1/s1
NCI pathway
Reactome pathway
US Patent
n/an/a>1.00E+4n/an/an/an/an/an/a
University of Namur
Assay Description
Human GSK3beta (expressed and prified from SF21 cells) is obtained from the University Dundee/Scotland (Dr. James Hastie—Dept. of Biochemistry) ...
J Med Chem 51: 3077-80 (2008)
BindingDB Entry DOI: 10.7270/Q21G0PJ6
Tyrosine-protein kinase SYK
(Homo sapiens (Human))
BDBM375964
(US10947243, Example 41 | US9914735, Example 41)
Show SMILES C[C@@H](Oc1cc(cc2nn(C)cc12)-c1ccc(F)cn1)[C@H]1CNC(=O)C1 |r|
Show InChI InChI=1S/C19H19FN4O2/c1-11(13-7-19(25)22-8-13)26-18-6-12(16-4-3-14(20)9-21-16)5-17-15(18)10-24(2)23-17/h3-6,9-11,13H,7-8H2,1-2H3,(H,22,25)/t11-,13-/m1/s1
NCI pathway
Reactome pathway
US Patent
n/an/a 164n/an/an/an/an/an/a
University of Namur
Assay Description
Human GSK3beta (expressed and prified from SF21 cells) is obtained from the University Dundee/Scotland (Dr. James Hastie—Dept. of Biochemistry) ...
J Med Chem 51: 3077-80 (2008)
BindingDB Entry DOI: 10.7270/Q21G0PJ6
Aurora kinase B
(Homo sapiens (Human))
BDBM375964
(US10947243, Example 41 | US9914735, Example 41)
Show SMILES C[C@@H](Oc1cc(cc2nn(C)cc12)-c1ccc(F)cn1)[C@H]1CNC(=O)C1 |r|
Show InChI InChI=1S/C19H19FN4O2/c1-11(13-7-19(25)22-8-13)26-18-6-12(16-4-3-14(20)9-21-16)5-17-15(18)10-24(2)23-17/h3-6,9-11,13H,7-8H2,1-2H3,(H,22,25)/t11-,13-/m1/s1
Reactome pathway
US Patent
n/an/a>5.00E+4n/an/an/an/an/an/a
University of Namur
Assay Description
Recombinant human Aurora B (amino acids 1-344, clone number DU1773, Molecular weight 40.2 kDa, University of Dundee) was expressed as a fusion protei...
J Med Chem 51: 3077-80 (2008)
BindingDB Entry DOI: 10.7270/Q21G0PJ6
Receptor-type tyrosine-protein kinase FLT3
(Homo sapiens (Human))
BDBM375964
(US10947243, Example 41 | US9914735, Example 41)
Show SMILES C[C@@H](Oc1cc(cc2nn(C)cc12)-c1ccc(F)cn1)[C@H]1CNC(=O)C1 |r|
Show InChI InChI=1S/C19H19FN4O2/c1-11(13-7-19(25)22-8-13)26-18-6-12(16-4-3-14(20)9-21-16)5-17-15(18)10-24(2)23-17/h3-6,9-11,13H,7-8H2,1-2H3,(H,22,25)/t11-,13-/m1/s1
US Patent
n/an/a 4.28E+4n/an/an/an/an/an/a
University of Namur
Assay Description
FLT3 is obtained from Invitrogen in 50 mM Tris (pH7.5); 100 mM NaCl; 0.05 mM EDTA, 0.05% NP-40, 2 mM DTT; 50% Glycerol # PV3182; Lot 286671; sequence...
J Med Chem 51: 3077-80 (2008)
BindingDB Entry DOI: 10.7270/Q21G0PJ6
Glycogen synthase kinase-3 beta
(Homo sapiens (Human))
BDBM375964
(US10947243, Example 41 | US9914735, Example 41)
Show SMILES C[C@@H](Oc1cc(cc2nn(C)cc12)-c1ccc(F)cn1)[C@H]1CNC(=O)C1 |r|
Show InChI InChI=1S/C19H19FN4O2/c1-11(13-7-19(25)22-8-13)26-18-6-12(16-4-3-14(20)9-21-16)5-17-15(18)10-24(2)23-17/h3-6,9-11,13H,7-8H2,1-2H3,(H,22,25)/t11-,13-/m1/s1
NCI pathway
Reactome pathway
US Patent
n/an/a>1.00E+4n/an/an/an/an/an/a
University of Namur
Assay Description
Human GSK3beta (expressed and prified from SF21 cells) is obtained from the University Dundee/Scotland (Dr. James Hastie—Dept. of Biochemistry) ...
J Med Chem 51: 3077-80 (2008)
BindingDB Entry DOI: 10.7270/Q21G0PJ6
SYK (aa 342-635)
(Homo sapiens (Human))
BDBM375964
(US10947243, Example 41 | US9914735, Example 41)
Show SMILES C[C@@H](Oc1cc(cc2nn(C)cc12)-c1ccc(F)cn1)[C@H]1CNC(=O)C1 |r|
Show InChI InChI=1S/C19H19FN4O2/c1-11(13-7-19(25)22-8-13)26-18-6-12(16-4-3-14(20)9-21-16)5-17-15(18)10-24(2)23-17/h3-6,9-11,13H,7-8H2,1-2H3,(H,22,25)/t11-,13-/m1/s1
US Patent
n/an/a 164n/an/an/an/an/an/a
Boehringer Ingelheim International GmbH
US Patent
Assay Description
Recombinant human Syk (amino acids 342-635) was expressed as a fusion protein with an N-terminal GST tag, affinity-purified and deep-frozen at a conc...
US Patent US10947243 (2021)
Aurora kinase B
(Homo sapiens (Human))
BDBM375964
(US10947243, Example 41 | US9914735, Example 41)
Show SMILES C[C@@H](Oc1cc(cc2nn(C)cc12)-c1ccc(F)cn1)[C@H]1CNC(=O)C1 |r|
Show InChI InChI=1S/C19H19FN4O2/c1-11(13-7-19(25)22-8-13)26-18-6-12(16-4-3-14(20)9-21-16)5-17-15(18)10-24(2)23-17/h3-6,9-11,13H,7-8H2,1-2H3,(H,22,25)/t11-,13-/m1/s1
Reactome pathway
US Patent
n/an/a>5.00E+4n/an/an/an/an/an/a
Boehringer Ingelheim International GmbH
US Patent
Assay Description
Recombinant human Aurora B (amino acids 1-344, clone number DU1773, Molecular weight 40.2 kDa, University of Dundee) was expressed as a fusion protei...
US Patent US10947243 (2021)
Receptor-type tyrosine-protein kinase FLT3
(Homo sapiens (Human))
BDBM375964
(US10947243, Example 41 | US9914735, Example 41)
Show SMILES C[C@@H](Oc1cc(cc2nn(C)cc12)-c1ccc(F)cn1)[C@H]1CNC(=O)C1 |r|
Show InChI InChI=1S/C19H19FN4O2/c1-11(13-7-19(25)22-8-13)26-18-6-12(16-4-3-14(20)9-21-16)5-17-15(18)10-24(2)23-17/h3-6,9-11,13H,7-8H2,1-2H3,(H,22,25)/t11-,13-/m1/s1
US Patent
n/an/a 4.28E+4n/an/an/an/an/an/a
Boehringer Ingelheim International GmbH
US Patent
Assay Description
FLT3 is obtained from Invitrogen in 50 mM Tris (pH7.5); 100 mM NaCl; 0.05 mM EDTA, 0.05% NP-40, 2 mM DTT; 50% Glycerol # PV3182; Lot 286671; sequence...
US Patent US10947243 (2021)
SYK (aa 342-635)
(Homo sapiens (Human))
BDBM375964
(US10947243, Example 41 | US9914735, Example 41)
Show SMILES C[C@@H](Oc1cc(cc2nn(C)cc12)-c1ccc(F)cn1)[C@H]1CNC(=O)C1 |r|
Show InChI InChI=1S/C19H19FN4O2/c1-11(13-7-19(25)22-8-13)26-18-6-12(16-4-3-14(20)9-21-16)5-17-15(18)10-24(2)23-17/h3-6,9-11,13H,7-8H2,1-2H3,(H,22,25)/t11-,13-/m1/s1
US Patent
n/an/a 1n/an/an/an/an/an/a
Boehringer Ingelheim International GmbH
US Patent
Assay Description
Human GSK3beta (expressed and prified from SF21 cells) is obtained from the University Dundee/Scotland (Dr. James Hastie—Dept. of Biochemistry) in 50...
US Patent US10947243 (2021)
Aurora kinase B
(Homo sapiens (Human))
BDBM375964
(US10947243, Example 41 | US9914735, Example 41)
Show SMILES C[C@@H](Oc1cc(cc2nn(C)cc12)-c1ccc(F)cn1)[C@H]1CNC(=O)C1 |r|
Show InChI InChI=1S/C19H19FN4O2/c1-11(13-7-19(25)22-8-13)26-18-6-12(16-4-3-14(20)9-21-16)5-17-15(18)10-24(2)23-17/h3-6,9-11,13H,7-8H2,1-2H3,(H,22,25)/t11-,13-/m1/s1
Reactome pathway
US Patent
n/an/a 308n/an/an/an/an/an/a
Boehringer Ingelheim International GmbH
US Patent
Assay Description
Recombinant human Syk (amino acids 342-635) was expressed as a fusion protein with an N-terminal GST tag, affinity-purified and deep-frozen at a conc...
US Patent US10947243 (2021)
Receptor-type tyrosine-protein kinase FLT3
(Homo sapiens (Human))
BDBM375964
(US10947243, Example 41 | US9914735, Example 41)
Show SMILES C[C@@H](Oc1cc(cc2nn(C)cc12)-c1ccc(F)cn1)[C@H]1CNC(=O)C1 |r|
Show InChI InChI=1S/C19H19FN4O2/c1-11(13-7-19(25)22-8-13)26-18-6-12(16-4-3-14(20)9-21-16)5-17-15(18)10-24(2)23-17/h3-6,9-11,13H,7-8H2,1-2H3,(H,22,25)/t11-,13-/m1/s1
US Patent
n/an/a 505n/an/an/an/an/an/a
Boehringer Ingelheim International GmbH
US Patent
Assay Description
Recombinant human Aurora B (amino acids 1-344, clone number DU1773, Molecular weight 40.2 kDa, University of Dundee) was expressed as a fusion protei...
US Patent US10947243 (2021)
Glycogen synthase kinase-3 beta
(Homo sapiens (Human))
BDBM375964
(US10947243, Example 41 | US9914735, Example 41)
Show SMILES C[C@@H](Oc1cc(cc2nn(C)cc12)-c1ccc(F)cn1)[C@H]1CNC(=O)C1 |r|
Show InChI InChI=1S/C19H19FN4O2/c1-11(13-7-19(25)22-8-13)26-18-6-12(16-4-3-14(20)9-21-16)5-17-15(18)10-24(2)23-17/h3-6,9-11,13H,7-8H2,1-2H3,(H,22,25)/t11-,13-/m1/s1
NCI pathway
Reactome pathway
US Patent
n/an/a>1.00E+4n/an/an/an/an/an/a
Boehringer Ingelheim International GmbH
US Patent
Assay Description
FLT3 is obtained from Invitrogen in 50 mM Tris (pH7.5); 100 mM NaCl; 0.05 mM EDTA, 0.05% NP-40, 2 mM DTT; 50% Glycerol # PV3182; Lot 286671; sequence...
US Patent US10947243 (2021)
SYK (aa 342-635)
(Homo sapiens (Human))
BDBM375964
(US10947243, Example 41 | US9914735, Example 41)
Show SMILES C[C@@H](Oc1cc(cc2nn(C)cc12)-c1ccc(F)cn1)[C@H]1CNC(=O)C1 |r|
Show InChI InChI=1S/C19H19FN4O2/c1-11(13-7-19(25)22-8-13)26-18-6-12(16-4-3-14(20)9-21-16)5-17-15(18)10-24(2)23-17/h3-6,9-11,13H,7-8H2,1-2H3,(H,22,25)/t11-,13-/m1/s1
US Patent
n/an/a 164n/an/an/an/an/an/a
Boehringer Ingelheim International GmbH
US Patent
Assay Description
Human GSK3beta (expressed and prified from SF21 cells) is obtained from the University Dundee/Scotland (Dr. James Hastie—Dept. of Biochemistry) in 50...
US Patent US10947243 (2021)
Aurora kinase B
(Homo sapiens (Human))
BDBM375964
(US10947243, Example 41 | US9914735, Example 41)
Show SMILES C[C@@H](Oc1cc(cc2nn(C)cc12)-c1ccc(F)cn1)[C@H]1CNC(=O)C1 |r|
Show InChI InChI=1S/C19H19FN4O2/c1-11(13-7-19(25)22-8-13)26-18-6-12(16-4-3-14(20)9-21-16)5-17-15(18)10-24(2)23-17/h3-6,9-11,13H,7-8H2,1-2H3,(H,22,25)/t11-,13-/m1/s1
Reactome pathway
US Patent
n/an/a>5.00E+4n/an/an/an/an/an/a
Boehringer Ingelheim International GmbH
US Patent
Assay Description
Recombinant human Syk (amino acids 342-635) was expressed as a fusion protein with an N-terminal GST tag, affinity-purified and deep-frozen at a conc...
US Patent US10947243 (2021)
Receptor-type tyrosine-protein kinase FLT3
(Homo sapiens (Human))
BDBM375964
(US10947243, Example 41 | US9914735, Example 41)
Show SMILES C[C@@H](Oc1cc(cc2nn(C)cc12)-c1ccc(F)cn1)[C@H]1CNC(=O)C1 |r|
Show InChI InChI=1S/C19H19FN4O2/c1-11(13-7-19(25)22-8-13)26-18-6-12(16-4-3-14(20)9-21-16)5-17-15(18)10-24(2)23-17/h3-6,9-11,13H,7-8H2,1-2H3,(H,22,25)/t11-,13-/m1/s1
US Patent
n/an/a 4.28E+4n/an/an/an/an/an/a
Boehringer Ingelheim International GmbH
US Patent
Assay Description
Recombinant human Aurora B (amino acids 1-344, clone number DU1773, Molecular weight 40.2 kDa, University of Dundee) was expressed as a fusion protei...
US Patent US10947243 (2021)
Aurora kinase B
(Homo sapiens (Human))
BDBM375964
(US10947243, Example 41 | US9914735, Example 41)
Show SMILES C[C@@H](Oc1cc(cc2nn(C)cc12)-c1ccc(F)cn1)[C@H]1CNC(=O)C1 |r|
Show InChI InChI=1S/C19H19FN4O2/c1-11(13-7-19(25)22-8-13)26-18-6-12(16-4-3-14(20)9-21-16)5-17-15(18)10-24(2)23-17/h3-6,9-11,13H,7-8H2,1-2H3,(H,22,25)/t11-,13-/m1/s1
Reactome pathway
US Patent
n/an/a>5.00E+4n/an/an/an/an/an/a
University of Namur
Assay Description
Recombinant human Aurora B (amino acids 1-344, clone number DU1773, Molecular weight 40.2 kDa, University of Dundee) was expressed as a fusion protei...
J Med Chem 51: 3077-80 (2008)
BindingDB Entry DOI: 10.7270/Q21G0PJ6