BDBM37621 3-(4-Chloro-phenyl)-2-methyl-4,5,6,7-tetrahydro-cyclopenta[d]pyrazolo[1,5-a]pyrimidin-8-one::MLS000034815::SMR000012513::cid_653420
SMILES: Cc1[nH]n2c(nc3CCCc3c2=O)c1-c1ccc(Cl)cc1
InChI Key: InChIKey=RSWQWXRGEAJFMC-UHFFFAOYSA-N
Data: 2 KI  2 IC50
Activity Spreadsheet -- Enzyme Inhibition Constant Data from BindingDB
Found 4 hits for monomerid = 37621
Trg + Lig
Ki
nM
ΔG°
kcal/mole
IC50
nM
Kd
nM
EC50/IC50
nM
koff
s-1
kon
M-1s-1
pHTemp
°C
fMet-Leu-Phe receptor
(Homo sapiens (Human))
BDBM37621
(3-(4-Chloro-phenyl)-2-methyl-4,5,6,7-tetrahydro-cy...)
Show SMILES Cc1[nH]n2c(nc3CCCc3c2=O)c1-c1ccc(Cl)cc1
Show InChI InChI=1S/C16H14ClN3O/c1-9-14(10-5-7-11(17)8-6-10)15-18-13-4-2-3-12(13)16(21)20(15)19-9/h5-8,19H,2-4H2,1H3
Reactome pathway
PCBioAssay
9.20E+3n/an/an/an/an/an/an/an/a
NMMLSC
Curated by PubChem BioAssay
Assay Description
University of New Mexico Assay Overview: Assay Support: NIH 1R03MH076381-01 Assay for Formylpeptide Receptor Family Ligands PI: Bruce S. Edwards, Ph...
PubChem Bioassay (2007)
BindingDB Entry DOI: 10.7270/Q2NZ862K
N-formyl peptide receptor 2
(Homo sapiens (Human))
BDBM37621
(3-(4-Chloro-phenyl)-2-methyl-4,5,6,7-tetrahydro-cy...)
Show SMILES Cc1[nH]n2c(nc3CCCc3c2=O)c1-c1ccc(Cl)cc1
Show InChI InChI=1S/C16H14ClN3O/c1-9-14(10-5-7-11(17)8-6-10)15-18-13-4-2-3-12(13)16(21)20(15)19-9/h5-8,19H,2-4H2,1H3
NCI pathway
Reactome pathway
PCBioAssay
>4.03E+4n/an/an/an/an/an/an/an/a
NMMLSC
Curated by PubChem BioAssay
Assay Description
University of New Mexico Assay Overview Assay Support: NIH 1R03MH076381-01 Assay for Formylpeptide Receptor Family Ligands PI: Bruce S. Edwards, Ph....
PubChem Bioassay (2007)
BindingDB Entry DOI: 10.7270/Q2DF6PMF
N-formyl peptide receptor 2
(Homo sapiens (Human))
BDBM37621
(3-(4-Chloro-phenyl)-2-methyl-4,5,6,7-tetrahydro-cy...)
Show SMILES Cc1[nH]n2c(nc3CCCc3c2=O)c1-c1ccc(Cl)cc1
Show InChI InChI=1S/C16H14ClN3O/c1-9-14(10-5-7-11(17)8-6-10)15-18-13-4-2-3-12(13)16(21)20(15)19-9/h5-8,19H,2-4H2,1H3
NCI pathway
Reactome pathway
PCBioAssay
n/an/a>6.67E+4n/an/an/an/an/an/a
NMMLSC
Curated by PubChem BioAssay
Assay Description
University of New Mexico Assay Overview Assay Support: NIH 1R03MH076381-01 Assay for Formylpeptide Receptor Family Ligands PI: Bruce S. Edwards, Ph....
PubChem Bioassay (2007)
BindingDB Entry DOI: 10.7270/Q2DF6PMF
fMet-Leu-Phe receptor
(Homo sapiens (Human))
BDBM37621
(3-(4-Chloro-phenyl)-2-methyl-4,5,6,7-tetrahydro-cy...)
Show SMILES Cc1[nH]n2c(nc3CCCc3c2=O)c1-c1ccc(Cl)cc1
Show InChI InChI=1S/C16H14ClN3O/c1-9-14(10-5-7-11(17)8-6-10)15-18-13-4-2-3-12(13)16(21)20(15)19-9/h5-8,19H,2-4H2,1H3
Reactome pathway
PCBioAssay
n/an/a 1.41E+4n/an/an/an/an/an/a
NMMLSC
Curated by PubChem BioAssay
Assay Description
University of New Mexico Assay Overview: Assay Support: NIH 1R03MH076381-01 Assay for Formylpeptide Receptor Family Ligands PI: Bruce S. Edwards, Ph...
PubChem Bioassay (2007)
BindingDB Entry DOI: 10.7270/Q2J67FB5