null
SMILES: COc1ccncc1N(C)c1cnc2c(ccc(F)c2c1)C(=O)Nc1cnccc1[C@@H]1C[C@H](C)C[C@H](N)C1
InChI Key: InChIKey=QCACBXIYMYBVKS-OTWHNJEPSA-N
Activity Spreadsheet -- Enzyme Inhibition Constant Data from BindingDB
Found 9 hits for monomerid = 376819
Trg + Lig
Ki
nM
ΔG°
kcal/mole
IC50
nM
Kd
nM
EC50/IC50
nM
koff
s-1
kon
M-1s-1
pHTemp
°C
Serine/threonine-protein kinase pim-1
(Homo sapiens (Human))
BDBM376819
(N-(4-((1R,3S,5S)-3-Amino-5-methylcyclohexyl)pyridi...)
Show SMILES COc1ccncc1N(C)c1cnc2c(ccc(F)c2c1)C(=O)Nc1cnccc1[C@@H]1C[C@H](C)C[C@H](N)C1 |r|
Show InChI InChI=1S/C29H31FN6O2/c1-17-10-18(12-19(31)11-17)21-6-8-32-15-25(21)35-29(37)22-4-5-24(30)23-13-20(14-34-28(22)23)36(2)26-16-33-9-7-27(26)38-3/h4-9,13-19H,10-12,31H2,1-3H3,(H,35,37)/t17-,18+,19-/m0/s1
US Patent
n/an/a<10n/an/an/an/an/an/a
Montana State University
Assay Description
Pim-1 and Pim-3 kinase assays—20 μL reactions were run in white 384 well polystyrene plates dotted with 0.8 μL compound/DMSO in the assay b...
J Med Chem 50: 4928-38 (2007)
BindingDB Entry DOI: 10.7270/Q20G3NF8
Serine/threonine-protein kinase pim-2
(Homo sapiens (Human))
BDBM376819
(N-(4-((1R,3S,5S)-3-Amino-5-methylcyclohexyl)pyridi...)
Show SMILES COc1ccncc1N(C)c1cnc2c(ccc(F)c2c1)C(=O)Nc1cnccc1[C@@H]1C[C@H](C)C[C@H](N)C1 |r|
Show InChI InChI=1S/C29H31FN6O2/c1-17-10-18(12-19(31)11-17)21-6-8-32-15-25(21)35-29(37)22-4-5-24(30)23-13-20(14-34-28(22)23)36(2)26-16-33-9-7-27(26)38-3/h4-9,13-19H,10-12,31H2,1-3H3,(H,35,37)/t17-,18+,19-/m0/s1
US Patent
n/an/a<100n/an/an/an/an/an/a
Montana State University
Assay Description
Pim-2 kinase assay—20 μL reactions were run in white 384 well polystyrene plates dotted with 0.8 μL compound/DMSO in the assay buffer (50 m...
J Med Chem 50: 4928-38 (2007)
BindingDB Entry DOI: 10.7270/Q20G3NF8
Serine/threonine-protein kinase pim-3
(Homo sapiens (Human))
BDBM376819
(N-(4-((1R,3S,5S)-3-Amino-5-methylcyclohexyl)pyridi...)
Show SMILES COc1ccncc1N(C)c1cnc2c(ccc(F)c2c1)C(=O)Nc1cnccc1[C@@H]1C[C@H](C)C[C@H](N)C1 |r|
Show InChI InChI=1S/C29H31FN6O2/c1-17-10-18(12-19(31)11-17)21-6-8-32-15-25(21)35-29(37)22-4-5-24(30)23-13-20(14-34-28(22)23)36(2)26-16-33-9-7-27(26)38-3/h4-9,13-19H,10-12,31H2,1-3H3,(H,35,37)/t17-,18+,19-/m0/s1
US Patent
n/an/a<10n/an/an/an/an/an/a
Montana State University
Assay Description
Pim-1 and Pim-3 kinase assays—20 μL reactions were run in white 384 well polystyrene plates dotted with 0.8 μL compound/DMSO in the assay b...
J Med Chem 50: 4928-38 (2007)
BindingDB Entry DOI: 10.7270/Q20G3NF8
Serine/threonine-protein kinase pim-1
(Homo sapiens (Human))
BDBM376819
(N-(4-((1R,3S,5S)-3-Amino-5-methylcyclohexyl)pyridi...)
Show SMILES COc1ccncc1N(C)c1cnc2c(ccc(F)c2c1)C(=O)Nc1cnccc1[C@@H]1C[C@H](C)C[C@H](N)C1 |r|
Show InChI InChI=1S/C29H31FN6O2/c1-17-10-18(12-19(31)11-17)21-6-8-32-15-25(21)35-29(37)22-4-5-24(30)23-13-20(14-34-28(22)23)36(2)26-16-33-9-7-27(26)38-3/h4-9,13-19H,10-12,31H2,1-3H3,(H,35,37)/t17-,18+,19-/m0/s1
US Patent
n/an/a<10n/an/an/an/an/an/a
Abbott Laboratories
Assay Description
Pim-1 and Pim-3 kinase assays-20 μL reactions were run in white 384 well polystyrene plates dotted with 0.8 μL compound/DMSO in the assay b...
J Med Chem 50: 641-62 (2007)
BindingDB Entry DOI: 10.7270/Q2MP55J7
Serine/threonine-protein kinase pim-3
(Homo sapiens (Human))
BDBM376819
(N-(4-((1R,3S,5S)-3-Amino-5-methylcyclohexyl)pyridi...)
Show SMILES COc1ccncc1N(C)c1cnc2c(ccc(F)c2c1)C(=O)Nc1cnccc1[C@@H]1C[C@H](C)C[C@H](N)C1 |r|
Show InChI InChI=1S/C29H31FN6O2/c1-17-10-18(12-19(31)11-17)21-6-8-32-15-25(21)35-29(37)22-4-5-24(30)23-13-20(14-34-28(22)23)36(2)26-16-33-9-7-27(26)38-3/h4-9,13-19H,10-12,31H2,1-3H3,(H,35,37)/t17-,18+,19-/m0/s1
US Patent
n/an/a<10n/an/an/an/an/an/a
TBA
Assay Description
Pim-1 and Pim-3 kinase assays-20 μL reactions were run in white 384 well polystyrene plates dotted with 0.8 μL compound/DMSO in the assay b...
Citation and Details
BindingDB Entry DOI: 10.7270/Q20V8GZM
Serine/threonine-protein kinase pim-3
(Homo sapiens (Human))
BDBM376819
(N-(4-((1R,3S,5S)-3-Amino-5-methylcyclohexyl)pyridi...)
Show SMILES COc1ccncc1N(C)c1cnc2c(ccc(F)c2c1)C(=O)Nc1cnccc1[C@@H]1C[C@H](C)C[C@H](N)C1 |r|
Show InChI InChI=1S/C29H31FN6O2/c1-17-10-18(12-19(31)11-17)21-6-8-32-15-25(21)35-29(37)22-4-5-24(30)23-13-20(14-34-28(22)23)36(2)26-16-33-9-7-27(26)38-3/h4-9,13-19H,10-12,31H2,1-3H3,(H,35,37)/t17-,18+,19-/m0/s1
US Patent
n/an/a<10n/an/an/an/an/an/a
Abbott Laboratories
Assay Description
Pim-1 and Pim-3 kinase assays-20 μL reactions were run in white 384 well polystyrene plates dotted with 0.8 μL compound/DMSO in the assay b...
J Med Chem 50: 641-62 (2007)
BindingDB Entry DOI: 10.7270/Q2MP55J7
Serine/threonine-protein kinase pim-1
(Homo sapiens (Human))
BDBM376819
(N-(4-((1R,3S,5S)-3-Amino-5-methylcyclohexyl)pyridi...)
Show SMILES COc1ccncc1N(C)c1cnc2c(ccc(F)c2c1)C(=O)Nc1cnccc1[C@@H]1C[C@H](C)C[C@H](N)C1 |r|
Show InChI InChI=1S/C29H31FN6O2/c1-17-10-18(12-19(31)11-17)21-6-8-32-15-25(21)35-29(37)22-4-5-24(30)23-13-20(14-34-28(22)23)36(2)26-16-33-9-7-27(26)38-3/h4-9,13-19H,10-12,31H2,1-3H3,(H,35,37)/t17-,18+,19-/m0/s1
US Patent
n/an/a<10n/an/an/an/an/an/a
TBA
Assay Description
Pim-1 and Pim-3 kinase assays-20 μL reactions were run in white 384 well polystyrene plates dotted with 0.8 μL compound/DMSO in the assay b...
Citation and Details
BindingDB Entry DOI: 10.7270/Q20V8GZM
Serine/threonine-protein kinase pim-2
(Homo sapiens (Human))
BDBM376819
(N-(4-((1R,3S,5S)-3-Amino-5-methylcyclohexyl)pyridi...)
Show SMILES COc1ccncc1N(C)c1cnc2c(ccc(F)c2c1)C(=O)Nc1cnccc1[C@@H]1C[C@H](C)C[C@H](N)C1 |r|
Show InChI InChI=1S/C29H31FN6O2/c1-17-10-18(12-19(31)11-17)21-6-8-32-15-25(21)35-29(37)22-4-5-24(30)23-13-20(14-34-28(22)23)36(2)26-16-33-9-7-27(26)38-3/h4-9,13-19H,10-12,31H2,1-3H3,(H,35,37)/t17-,18+,19-/m0/s1
US Patent
n/an/a<100n/an/an/an/an/an/a
TBA
Assay Description
Pim-1 and Pim-3 kinase assays-20 μL reactions were run in white 384 well polystyrene plates dotted with 0.8 μL compound/DMSO in the assay b...
Citation and Details
BindingDB Entry DOI: 10.7270/Q20V8GZM
Serine/threonine-protein kinase pim-2
(Homo sapiens (Human))
BDBM376819
(N-(4-((1R,3S,5S)-3-Amino-5-methylcyclohexyl)pyridi...)
Show SMILES COc1ccncc1N(C)c1cnc2c(ccc(F)c2c1)C(=O)Nc1cnccc1[C@@H]1C[C@H](C)C[C@H](N)C1 |r|
Show InChI InChI=1S/C29H31FN6O2/c1-17-10-18(12-19(31)11-17)21-6-8-32-15-25(21)35-29(37)22-4-5-24(30)23-13-20(14-34-28(22)23)36(2)26-16-33-9-7-27(26)38-3/h4-9,13-19H,10-12,31H2,1-3H3,(H,35,37)/t17-,18+,19-/m0/s1
US Patent
n/an/a<100n/an/an/an/an/an/a
Abbott Laboratories
Assay Description
Pim-2 kinase assay-20 μL reactions were run in white 384 well polystyrene plates dotted with 0.8 μL compound/DMSO in the assay buffer (50 m...
J Med Chem 50: 641-62 (2007)
BindingDB Entry DOI: 10.7270/Q2MP55J7