BDBM37690 MLS000045944::N-(5-imidazo[1,2-a]pyrimidin-2-yl-2-methoxy-phenyl)cyclopropanecarboxamide::N-(5-imidazo[1,2-a]pyrimidin-2-yl-2-methoxyphenyl)cyclopropanecarboxamide::N-[5-(2-imidazo[1,2-a]pyrimidinyl)-2-methoxyphenyl]cyclopropanecarboxamide::SMR000028316::cid_3236767
SMILES: COc1ccc(cc1NC(=O)C1CC1)-c1cn2cccnc2n1
InChI Key: InChIKey=RCIJAXXYMNMRPW-UHFFFAOYSA-N
Data: 4 KI  4 IC50
Activity Spreadsheet -- Enzyme Inhibition Constant Data from BindingDB
Found 8 hits for monomerid = 37690
Trg + Lig
Ki
nM
ΔG°
kcal/mole
IC50
nM
Kd
nM
EC50/IC50
nM
koff
s-1
kon
M-1s-1
pHTemp
°C
N-formyl peptide receptor 2
(Homo sapiens (Human))
BDBM37690
(MLS000045944 | N-(5-imidazo[1,2-a]pyrimidin-2-yl-2...)
Show SMILES COc1ccc(cc1NC(=O)C1CC1)-c1cn2cccnc2n1
Show InChI InChI=1S/C17H16N4O2/c1-23-15-6-5-12(9-13(15)19-16(22)11-3-4-11)14-10-21-8-2-7-18-17(21)20-14/h2,5-11H,3-4H2,1H3,(H,19,22)
NCI pathway
Reactome pathway
PCBioAssay
4.10E+3n/an/an/an/an/an/an/an/a
NMMLSC
Curated by PubChem BioAssay
Assay Description
University of New Mexico Assay Overview: Assay Support: NIH 1R03MH076381-01 Assay for Formylpeptide Receptor Family Ligands PI: Bruce S. Edwards, Ph...
PubChem Bioassay (2007)
BindingDB Entry DOI: 10.7270/Q2SF2TKJ
N-formyl peptide receptor 2
(Homo sapiens (Human))
BDBM37690
(MLS000045944 | N-(5-imidazo[1,2-a]pyrimidin-2-yl-2...)
Show SMILES COc1ccc(cc1NC(=O)C1CC1)-c1cn2cccnc2n1
Show InChI InChI=1S/C17H16N4O2/c1-23-15-6-5-12(9-13(15)19-16(22)11-3-4-11)14-10-21-8-2-7-18-17(21)20-14/h2,5-11H,3-4H2,1H3,(H,19,22)
NCI pathway
Reactome pathway
PCBioAssay
4.60E+3n/an/an/an/an/an/an/an/a
NMMLSC
Curated by PubChem BioAssay
Assay Description
University of New Mexico Assay Overview Assay Support: NIH 1R03MH076381-01 Assay for Formylpeptide Receptor Family Ligands PI: Bruce S. Edwards, Ph....
PubChem Bioassay (2007)
BindingDB Entry DOI: 10.7270/Q2DF6PMF
fMet-Leu-Phe receptor
(Homo sapiens (Human))
BDBM37690
(MLS000045944 | N-(5-imidazo[1,2-a]pyrimidin-2-yl-2...)
Show SMILES COc1ccc(cc1NC(=O)C1CC1)-c1cn2cccnc2n1
Show InChI InChI=1S/C17H16N4O2/c1-23-15-6-5-12(9-13(15)19-16(22)11-3-4-11)14-10-21-8-2-7-18-17(21)20-14/h2,5-11H,3-4H2,1H3,(H,19,22)
Reactome pathway
PCBioAssay
>4.37E+4n/an/an/an/an/an/an/an/a
NMMLSC
Curated by PubChem BioAssay
Assay Description
University of New Mexico Assay Overview: Assay Support: NIH 1R03MH076381-01 Assay for Formylpeptide Receptor Family Ligands PI: Bruce S. Edwards, Ph...
PubChem Bioassay (2007)
BindingDB Entry DOI: 10.7270/Q2NZ862K
fMet-Leu-Phe receptor
(Homo sapiens (Human))
BDBM37690
(MLS000045944 | N-(5-imidazo[1,2-a]pyrimidin-2-yl-2...)
Show SMILES COc1ccc(cc1NC(=O)C1CC1)-c1cn2cccnc2n1
Show InChI InChI=1S/C17H16N4O2/c1-23-15-6-5-12(9-13(15)19-16(22)11-3-4-11)14-10-21-8-2-7-18-17(21)20-14/h2,5-11H,3-4H2,1H3,(H,19,22)
Reactome pathway
PCBioAssay
>4.72E+4n/an/an/an/an/an/an/an/a
NMMLSC
Curated by PubChem BioAssay
Assay Description
University of New Mexico Assay Overview: Assay Support: NIH 1R03MH076381-01 Assay for Formylpeptide Receptor Family Ligands PI: Bruce S. Edwards, Ph...
PubChem Bioassay (2007)
BindingDB Entry DOI: 10.7270/Q21V5CBG
fMet-Leu-Phe receptor
(Homo sapiens (Human))
BDBM37690
(MLS000045944 | N-(5-imidazo[1,2-a]pyrimidin-2-yl-2...)
Show SMILES COc1ccc(cc1NC(=O)C1CC1)-c1cn2cccnc2n1
Show InChI InChI=1S/C17H16N4O2/c1-23-15-6-5-12(9-13(15)19-16(22)11-3-4-11)14-10-21-8-2-7-18-17(21)20-14/h2,5-11H,3-4H2,1H3,(H,19,22)
Reactome pathway
PCBioAssay
n/an/a>7.21E+4n/an/an/an/an/an/a
NMMLSC
Curated by PubChem BioAssay
Assay Description
University of New Mexico Assay Overview: Assay Support: NIH 1R03MH076381-01 Assay for Formylpeptide Receptor Family Ligands PI: Bruce S. Edwards, Ph...
PubChem Bioassay (2007)
BindingDB Entry DOI: 10.7270/Q2X34VV3
fMet-Leu-Phe receptor
(Homo sapiens (Human))
BDBM37690
(MLS000045944 | N-(5-imidazo[1,2-a]pyrimidin-2-yl-2...)
Show SMILES COc1ccc(cc1NC(=O)C1CC1)-c1cn2cccnc2n1
Show InChI InChI=1S/C17H16N4O2/c1-23-15-6-5-12(9-13(15)19-16(22)11-3-4-11)14-10-21-8-2-7-18-17(21)20-14/h2,5-11H,3-4H2,1H3,(H,19,22)
Reactome pathway
PCBioAssay
n/an/a>6.67E+4n/an/an/an/an/an/a
NMMLSC
Curated by PubChem BioAssay
Assay Description
University of New Mexico Assay Overview: Assay Support: NIH 1R03MH076381-01 Assay for Formylpeptide Receptor Family Ligands PI: Bruce S. Edwards, Ph...
PubChem Bioassay (2007)
BindingDB Entry DOI: 10.7270/Q2J67FB5
N-formyl peptide receptor 2
(Homo sapiens (Human))
BDBM37690
(MLS000045944 | N-(5-imidazo[1,2-a]pyrimidin-2-yl-2...)
Show SMILES COc1ccc(cc1NC(=O)C1CC1)-c1cn2cccnc2n1
Show InChI InChI=1S/C17H16N4O2/c1-23-15-6-5-12(9-13(15)19-16(22)11-3-4-11)14-10-21-8-2-7-18-17(21)20-14/h2,5-11H,3-4H2,1H3,(H,19,22)
NCI pathway
Reactome pathway
PCBioAssay
n/an/a 6.70E+3n/an/an/an/an/an/a
NMMLSC
Curated by PubChem BioAssay
Assay Description
University of New Mexico Assay Overview: Assay Support: NIH 1R03MH076381-01 Assay for Formylpeptide Receptor Family Ligands PI: Bruce S. Edwards, Ph...
PubChem Bioassay (2007)
BindingDB Entry DOI: 10.7270/Q2NP22V6
N-formyl peptide receptor 2
(Homo sapiens (Human))
BDBM37690
(MLS000045944 | N-(5-imidazo[1,2-a]pyrimidin-2-yl-2...)
Show SMILES COc1ccc(cc1NC(=O)C1CC1)-c1cn2cccnc2n1
Show InChI InChI=1S/C17H16N4O2/c1-23-15-6-5-12(9-13(15)19-16(22)11-3-4-11)14-10-21-8-2-7-18-17(21)20-14/h2,5-11H,3-4H2,1H3,(H,19,22)
NCI pathway
Reactome pathway
PCBioAssay
n/an/a 7.60E+3n/an/an/an/an/an/a
NMMLSC
Curated by PubChem BioAssay
Assay Description
University of New Mexico Assay Overview Assay Support: NIH 1R03MH076381-01 Assay for Formylpeptide Receptor Family Ligands PI: Bruce S. Edwards, Ph....
PubChem Bioassay (2007)
BindingDB Entry DOI: 10.7270/Q2DF6PMF