null
SMILES: NC(=O)c1c(N)n(nc1-c1ccc(Oc2cc(F)ccc2Cl)cc1)C1CCCN(C1)C#N
InChI Key: InChIKey=ZNGQRWDLKGPNAE-UHFFFAOYSA-N
Activity Spreadsheet -- Enzyme Inhibition Constant Data from BindingDB
Found 2 hits for monomerid = 377751
Trg + Lig
Ki
nM
ΔG°
kcal/mole
IC50
nM
Kd
nM
EC50/IC50
nM
koff
s-1
kon
M-1s-1
pHTemp
°C
Tyrosine-protein kinase BTK
(Homo sapiens (Human))
BDBM377751
(5-amino-3-[4-(2-chloro-5-fluoro- phenoxy)phenyl]-1...)
Show SMILES NC(=O)c1c(N)n(nc1-c1ccc(Oc2cc(F)ccc2Cl)cc1)C1CCCN(C1)C#N
Show InChI InChI=1S/C22H20ClFN6O2/c23-17-8-5-14(24)10-18(17)32-16-6-3-13(4-7-16)20-19(22(27)31)21(26)30(28-20)15-2-1-9-29(11-15)12-25/h3-8,10,15H,1-2,9,11,26H2,(H2,27,31)
NCI pathway
Reactome pathway
US Patent
n/an/a 0.810n/an/an/an/an/an/a
Pfizer Inc.
US Patent
Assay Description
BTK: TR-FRET LanthaScreen assays were performed by incubating a dilution series of inhibitor concentrations with 50 μM ATP, 100 nM FAM-Srctide p...
US Patent US10815213 (2020)
Tyrosine-protein kinase BTK
(Homo sapiens (Human))
BDBM377751
(5-amino-3-[4-(2-chloro-5-fluoro- phenoxy)phenyl]-1...)
Show SMILES NC(=O)c1c(N)n(nc1-c1ccc(Oc2cc(F)ccc2Cl)cc1)C1CCCN(C1)C#N
Show InChI InChI=1S/C22H20ClFN6O2/c23-17-8-5-14(24)10-18(17)32-16-6-3-13(4-7-16)20-19(22(27)31)21(26)30(28-20)15-2-1-9-29(11-15)12-25/h3-8,10,15H,1-2,9,11,26H2,(H2,27,31)
NCI pathway
Reactome pathway
US Patent
n/an/a 0.810n/an/an/an/an/an/a
Institut Claudius Regaud
Assay Description
TR-FRET LanthaScreen assays were performed by incubating a dilution series of inhibitor concentrations with 50 μM ATP, 100 nM FAM-Srctide peptid...
J Med Chem 48: 287-91 (2005)
BindingDB Entry DOI: 10.7270/Q2P271FD