null
SMILES: NC(=O)c1c(N)n(nc1-c1ccc(Cc2ccccc2Cl)cc1)[C@@H]1CCCN(C1)C#N
InChI Key: InChIKey=GSEHUFTWKYCSMQ-GOSISDBHSA-N
Activity Spreadsheet -- Enzyme Inhibition Constant Data from BindingDB
Found 2 hits for monomerid = 377778
Trg + Lig
Ki
nM
ΔG°
kcal/mole
IC50
nM
Kd
nM
EC50/IC50
nM
koff
s-1
kon
M-1s-1
pHTemp
°C
Tyrosine-protein kinase BTK
(Homo sapiens (Human))
BDBM377778
((R)-5-amino-3-(4-(2-chlorobenzyl)phenyl)-1-(1-cyan...)
Show SMILES NC(=O)c1c(N)n(nc1-c1ccc(Cc2ccccc2Cl)cc1)[C@@H]1CCCN(C1)C#N |r|
Show InChI InChI=1S/C23H23ClN6O/c24-19-6-2-1-4-17(19)12-15-7-9-16(10-8-15)21-20(23(27)31)22(26)30(28-21)18-5-3-11-29(13-18)14-25/h1-2,4,6-10,18H,3,5,11-13,26H2,(H2,27,31)/t18-/m1/s1
NCI pathway
Reactome pathway
US Patent
n/an/a 0.540n/an/an/an/an/an/a
Pfizer Inc.
US Patent
Assay Description
BTK: TR-FRET LanthaScreen assays were performed by incubating a dilution series of inhibitor concentrations with 50 μM ATP, 100 nM FAM-Srctide p...
US Patent US10815213 (2020)
Tyrosine-protein kinase BTK
(Homo sapiens (Human))
BDBM377778
((R)-5-amino-3-(4-(2-chlorobenzyl)phenyl)-1-(1-cyan...)
Show SMILES NC(=O)c1c(N)n(nc1-c1ccc(Cc2ccccc2Cl)cc1)[C@@H]1CCCN(C1)C#N |r|
Show InChI InChI=1S/C23H23ClN6O/c24-19-6-2-1-4-17(19)12-15-7-9-16(10-8-15)21-20(23(27)31)22(26)30(28-21)18-5-3-11-29(13-18)14-25/h1-2,4,6-10,18H,3,5,11-13,26H2,(H2,27,31)/t18-/m1/s1
NCI pathway
Reactome pathway
US Patent
n/an/a 0.540n/an/an/an/an/an/a
Institut Claudius Regaud
Assay Description
TR-FRET LanthaScreen assays were performed by incubating a dilution series of inhibitor concentrations with 50 μM ATP, 100 nM FAM-Srctide peptid...
J Med Chem 48: 287-91 (2005)
BindingDB Entry DOI: 10.7270/Q2P271FD