null
SMILES: NC(=O)c1c(N)n(nc1-c1ccc(Oc2ccc(F)cc2F)cc1)C1CCCN(C1)C(=O)\C=C\C(F)F
InChI Key: InChIKey=KSNRPWDSUMXQLE-MDZDMXLPSA-N
Activity Spreadsheet -- Enzyme Inhibition Constant Data from BindingDB
Found 4 hits for monomerid = 377850
Trg + Lig
Ki
nM
ΔG°
kcal/mole
IC50
nM
Kd
nM
EC50/IC50
nM
koff
s-1
kon
M-1s-1
pHTemp
°C
Tyrosine-protein kinase BTK
(Homo sapiens (Human))
BDBM377850
(5-amino-1-{(3R)-1-[(2E)-4,4-difluorobut-2-enoyl]pi...)
Show SMILES NC(=O)c1c(N)n(nc1-c1ccc(Oc2ccc(F)cc2F)cc1)C1CCCN(C1)C(=O)\C=C\C(F)F
Show InChI InChI=1S/C25H23F4N5O3/c26-15-5-8-19(18(27)12-15)37-17-6-3-14(4-7-17)23-22(25(31)36)24(30)34(32-23)16-2-1-11-33(13-16)21(35)10-9-20(28)29/h3-10,12,16,20H,1-2,11,13,30H2,(H2,31,36)/b10-9+
NCI pathway
Reactome pathway
US Patent
n/an/a 0.410n/an/an/an/an/an/a
Institut Claudius Regaud
Assay Description
TR-FRET LanthaScreen assays were performed by incubating a dilution series of inhibitor concentrations with 50 μM ATP, 100 nM FAM-Srctide peptid...
J Med Chem 48: 287-91 (2005)
BindingDB Entry DOI: 10.7270/Q2P271FD
Epidermal growth factor receptor
(Homo sapiens (Human))
BDBM377850
(5-amino-1-{(3R)-1-[(2E)-4,4-difluorobut-2-enoyl]pi...)
Show SMILES NC(=O)c1c(N)n(nc1-c1ccc(Oc2ccc(F)cc2F)cc1)C1CCCN(C1)C(=O)\C=C\C(F)F
Show InChI InChI=1S/C25H23F4N5O3/c26-15-5-8-19(18(27)12-15)37-17-6-3-14(4-7-17)23-22(25(31)36)24(30)34(32-23)16-2-1-11-33(13-16)21(35)10-9-20(28)29/h3-10,12,16,20H,1-2,11,13,30H2,(H2,31,36)/b10-9+
US Patent
n/an/a 274n/an/an/an/an/an/a
Pfizer Inc.
US Patent
Assay Description
EGFR: TR-FRET LanthaScreen assays were performed by incubating a dilution series of inhibitor concentrations with 20 μM ATP, 100 nM peptide subs...
US Patent US10815213 (2020)
Tyrosine-protein kinase BTK
(Homo sapiens (Human))
BDBM377850
(5-amino-1-{(3R)-1-[(2E)-4,4-difluorobut-2-enoyl]pi...)
Show SMILES NC(=O)c1c(N)n(nc1-c1ccc(Oc2ccc(F)cc2F)cc1)C1CCCN(C1)C(=O)\C=C\C(F)F
Show InChI InChI=1S/C25H23F4N5O3/c26-15-5-8-19(18(27)12-15)37-17-6-3-14(4-7-17)23-22(25(31)36)24(30)34(32-23)16-2-1-11-33(13-16)21(35)10-9-20(28)29/h3-10,12,16,20H,1-2,11,13,30H2,(H2,31,36)/b10-9+
NCI pathway
Reactome pathway
US Patent
n/an/a 0.410n/an/an/an/an/an/a
Pfizer Inc.
US Patent
Assay Description
BTK: TR-FRET LanthaScreen assays were performed by incubating a dilution series of inhibitor concentrations with 50 μM ATP, 100 nM FAM-Srctide p...
US Patent US10815213 (2020)
Epidermal growth factor receptor
(Homo sapiens (Human))
BDBM377850
(5-amino-1-{(3R)-1-[(2E)-4,4-difluorobut-2-enoyl]pi...)
Show SMILES NC(=O)c1c(N)n(nc1-c1ccc(Oc2ccc(F)cc2F)cc1)C1CCCN(C1)C(=O)\C=C\C(F)F
Show InChI InChI=1S/C25H23F4N5O3/c26-15-5-8-19(18(27)12-15)37-17-6-3-14(4-7-17)23-22(25(31)36)24(30)34(32-23)16-2-1-11-33(13-16)21(35)10-9-20(28)29/h3-10,12,16,20H,1-2,11,13,30H2,(H2,31,36)/b10-9+
US Patent
n/an/a 274n/an/an/an/an/an/a
Institut Claudius Regaud
Assay Description
TR-FRET LanthaScreen assays were performed by incubating a dilution series of inhibitor concentrations with 20 μM ATP, 100 nM peptide substrate ...
J Med Chem 48: 287-91 (2005)
BindingDB Entry DOI: 10.7270/Q2P271FD