BDBM37797 5-(3,4-dichlorophenyl)-7-(2-thienyl)-1,5,6,7-tetrahydro-[1,2,4]triazolo[1,5-a]pyrimidine::5-(3,4-dichlorophenyl)-7-thiophen-2-yl-1,5,6,7-tetrahydro-[1,2,4]triazolo[1,5-a]pyrimidine::MLS000114909::SMR000092182::cid_5309346
SMILES: Clc1ccc(cc1Cl)C1CC(c2cccs2)n2ncnc2N1
InChI Key: InChIKey=IOUCPTPGGGJRIL-UHFFFAOYSA-N
Data: 2 KI  3 IC50
Activity Spreadsheet -- Enzyme Inhibition Constant Data from BindingDB
Found 5 hits for monomerid = 37797
Trg + Lig
Ki
nM
ΔG°
kcal/mole
IC50
nM
Kd
nM
EC50/IC50
nM
koff
s-1
kon
M-1s-1
pHTemp
°C
N-formyl peptide receptor 2
(Homo sapiens (Human))
BDBM37797
(5-(3,4-dichlorophenyl)-7-(2-thienyl)-1,5,6,7-tetra...)
Show SMILES Clc1ccc(cc1Cl)C1CC(c2cccs2)n2ncnc2N1
Show InChI InChI=1S/C15H12Cl2N4S/c16-10-4-3-9(6-11(10)17)12-7-13(14-2-1-5-22-14)21-15(20-12)18-8-19-21/h1-6,8,12-13H,7H2,(H,18,19,20)
NCI pathway
Reactome pathway
PCBioAssay
>4.03E+4n/an/an/an/an/an/an/an/a
NMMLSC
Curated by PubChem BioAssay
Assay Description
University of New Mexico Assay Overview Assay Support: NIH 1R03MH076381-01 Assay for Formylpeptide Receptor Family Ligands PI: Bruce S. Edwards, Ph....
PubChem Bioassay (2007)
BindingDB Entry DOI: 10.7270/Q2DF6PMF
fMet-Leu-Phe receptor
(Homo sapiens (Human))
BDBM37797
(5-(3,4-dichlorophenyl)-7-(2-thienyl)-1,5,6,7-tetra...)
Show SMILES Clc1ccc(cc1Cl)C1CC(c2cccs2)n2ncnc2N1
Show InChI InChI=1S/C15H12Cl2N4S/c16-10-4-3-9(6-11(10)17)12-7-13(14-2-1-5-22-14)21-15(20-12)18-8-19-21/h1-6,8,12-13H,7H2,(H,18,19,20)
Reactome pathway
PCBioAssay
>4.37E+4n/an/an/an/an/an/an/an/a
NMMLSC
Curated by PubChem BioAssay
Assay Description
University of New Mexico Assay Overview: Assay Support: NIH 1R03MH076381-01 Assay for Formylpeptide Receptor Family Ligands PI: Bruce S. Edwards, Ph...
PubChem Bioassay (2007)
BindingDB Entry DOI: 10.7270/Q2NZ862K
neuropeptides B/W receptor 1
(Homo sapiens (Human))
BDBM37797
(5-(3,4-dichlorophenyl)-7-(2-thienyl)-1,5,6,7-tetra...)
Show SMILES Clc1ccc(cc1Cl)C1CC(c2cccs2)n2ncnc2N1
Show InChI InChI=1S/C15H12Cl2N4S/c16-10-4-3-9(6-11(10)17)12-7-13(14-2-1-5-22-14)21-15(20-12)18-8-19-21/h1-6,8,12-13H,7H2,(H,18,19,20)
Reactome pathway
PCBioAssay
n/an/a 4.87E+3n/an/an/an/an/an/a
The Scripps Research Institute Molecular Screening Center
Curated by PubChem BioAssay
Assay Description
Source (MLPCN Center Name): The Scripps Research Institute Molecular Screening Center (SRIMSC) Affiliation: The Scripps Research Institute, TSRI Assa...
PubChem Bioassay (2010)
BindingDB Entry DOI: 10.7270/Q2WH2NF9
fMet-Leu-Phe receptor
(Homo sapiens (Human))
BDBM37797
(5-(3,4-dichlorophenyl)-7-(2-thienyl)-1,5,6,7-tetra...)
Show SMILES Clc1ccc(cc1Cl)C1CC(c2cccs2)n2ncnc2N1
Show InChI InChI=1S/C15H12Cl2N4S/c16-10-4-3-9(6-11(10)17)12-7-13(14-2-1-5-22-14)21-15(20-12)18-8-19-21/h1-6,8,12-13H,7H2,(H,18,19,20)
Reactome pathway
PCBioAssay
n/an/a>6.67E+4n/an/an/an/an/an/a
NMMLSC
Curated by PubChem BioAssay
Assay Description
University of New Mexico Assay Overview: Assay Support: NIH 1R03MH076381-01 Assay for Formylpeptide Receptor Family Ligands PI: Bruce S. Edwards, Ph...
PubChem Bioassay (2007)
BindingDB Entry DOI: 10.7270/Q2J67FB5
N-formyl peptide receptor 2
(Homo sapiens (Human))
BDBM37797
(5-(3,4-dichlorophenyl)-7-(2-thienyl)-1,5,6,7-tetra...)
Show SMILES Clc1ccc(cc1Cl)C1CC(c2cccs2)n2ncnc2N1
Show InChI InChI=1S/C15H12Cl2N4S/c16-10-4-3-9(6-11(10)17)12-7-13(14-2-1-5-22-14)21-15(20-12)18-8-19-21/h1-6,8,12-13H,7H2,(H,18,19,20)
NCI pathway
Reactome pathway
PCBioAssay
n/an/a>6.67E+4n/an/an/an/an/an/a
NMMLSC
Curated by PubChem BioAssay
Assay Description
University of New Mexico Assay Overview Assay Support: NIH 1R03MH076381-01 Assay for Formylpeptide Receptor Family Ligands PI: Bruce S. Edwards, Ph....
PubChem Bioassay (2007)
BindingDB Entry DOI: 10.7270/Q2DF6PMF