BDBM378463 6-chloro-2-oxo-N-((1R,3r,5S)-8-((piperidin-4-ylmethyl)sulfonyl)-8-azabicyclo[3.2.1]octan-3-yl)indoline-5-carboxamide::US10266526, Compound 596
SMILES: Clc1cc2NC(=O)Cc2cc1C(=O)N[C@@H]1C[C@@H]2CC[C@H](C1)N2S(=O)(=O)CC1CCNCC1
InChI Key: InChIKey=CRSLJMLTIHNYMT-BJWYYQGGSA-N
Data: 3 IC50
Activity Spreadsheet -- Enzyme Inhibition Constant Data from BindingDB
Found 3 hits for monomerid = 378463
Trg + Lig
Ki
nM
ΔG°
kcal/mole
IC50
nM
Kd
nM
EC50/IC50
nM
koff
s-1
kon
M-1s-1
pHTemp
°C
Histone-lysine N-methyltransferase SMYD3
(Homo sapiens (Human))
BDBM378463
(6-chloro-2-oxo-N-((1R,3r,5S)-8-((piperidin-4-ylmet...)
Show SMILES Clc1cc2NC(=O)Cc2cc1C(=O)N[C@@H]1C[C@@H]2CC[C@H](C1)N2S(=O)(=O)CC1CCNCC1 |r,TLB:22:21:15.14.20:18.17|
Show InChI InChI=1S/C22H29ClN4O4S/c23-19-11-20-14(8-21(28)26-20)7-18(19)22(29)25-15-9-16-1-2-17(10-15)27(16)32(30,31)12-13-3-5-24-6-4-13/h7,11,13,15-17,24H,1-6,8-10,12H2,(H,25,29)(H,26,28)/t15-,16+,17-
US Patent
n/an/a 3.60n/an/an/an/an/an/a
ENSCMu
Assay Description
The assays were all performed in a buffer consisting of 25 mM Tris-Cl pH 8.0, 1 mM TCEP, 0.005% BSG, and 0.005% Tween 20, prepared on the day of use....
Bioorg Med Chem 14: 7241-57 (2006)
BindingDB Entry DOI: 10.7270/Q2DJ5HX2
Histone-lysine N-methyltransferase SMYD3
(Homo sapiens (Human))
BDBM378463
(6-chloro-2-oxo-N-((1R,3r,5S)-8-((piperidin-4-ylmet...)
Show SMILES Clc1cc2NC(=O)Cc2cc1C(=O)N[C@@H]1C[C@@H]2CC[C@H](C1)N2S(=O)(=O)CC1CCNCC1 |r,TLB:22:21:15.14.20:18.17|
Show InChI InChI=1S/C22H29ClN4O4S/c23-19-11-20-14(8-21(28)26-20)7-18(19)22(29)25-15-9-16-1-2-17(10-15)27(16)32(30,31)12-13-3-5-24-6-4-13/h7,11,13,15-17,24H,1-6,8-10,12H2,(H,25,29)(H,26,28)/t15-,16+,17-
n/an/a 4n/an/an/an/an/an/a
Epizyme Inc.
Curated by ChEMBL
Assay Description
Inhibition of full length N-terminal His-tagged SMYD3 (1 to 428 residues) (unknown origin) expressed in Escherichia coli using N-terminal GST-tagged ...
ACS Med Chem Lett 7: 134-8 (2016)
Article DOI: 10.1021/acsmedchemlett.5b00272
BindingDB Entry DOI: 10.7270/Q2NG4TPR
Histone-lysine N-methyltransferase SMYD3
(Homo sapiens (Human))
BDBM378463
(6-chloro-2-oxo-N-((1R,3r,5S)-8-((piperidin-4-ylmet...)
Show SMILES Clc1cc2NC(=O)Cc2cc1C(=O)N[C@@H]1C[C@@H]2CC[C@H](C1)N2S(=O)(=O)CC1CCNCC1 |r,TLB:22:21:15.14.20:18.17|
Show InChI InChI=1S/C22H29ClN4O4S/c23-19-11-20-14(8-21(28)26-20)7-18(19)22(29)25-15-9-16-1-2-17(10-15)27(16)32(30,31)12-13-3-5-24-6-4-13/h7,11,13,15-17,24H,1-6,8-10,12H2,(H,25,29)(H,26,28)/t15-,16+,17-
n/an/a 3.20E+3n/an/an/an/an/an/a
Epizyme Inc.
Curated by ChEMBL
Assay Description
Inhibition of human SMYD3 expressed in HEK293T/17 cells using FLAG-tagged MEKK2 as substrate incubated for 30 mins in low air flow area followed by i...
ACS Med Chem Lett 7: 134-8 (2016)
Article DOI: 10.1021/acsmedchemlett.5b00272
BindingDB Entry DOI: 10.7270/Q2NG4TPR