null
SMILES: c1ccc(cc1)-n1nnc2ccccc12
InChI Key: InChIKey=ZBJLUVHQIPUCPM-UHFFFAOYSA-N
Activity Spreadsheet -- Enzyme Inhibition Constant Data from BindingDB
Found 2 hits for monomerid = 3793
Trg + Lig
Ki
nM
ΔG°
kcal/mole
IC50
nM
Kd
nM
EC50/IC50
nM
koff
s-1
kon
M-1s-1
pHTemp
°C
Fibroblast growth factor receptor 1
(Homo sapiens (Human))
BDBM3793
(1-Phenylbenzimidazole deriv. 10 | 1-phenyl-1H-1,2,...)
Show SMILES c1ccc(cc1)-n1nnc2ccccc12
Show InChI InChI=1S/C12H9N3/c1-2-6-10(7-3-1)15-12-9-5-4-8-11(12)13-14-15/h1-9H
NCI pathway
Reactome pathway
n/an/a>5.00E+4n/an/an/an/a7.425
University of Auckland
Assay Description
IC50 is the inhibitor concentration which inhibits 50% of kinase activity that catalyzes the transfer of the terminal phosphate from [gamma-32P] labe...
J Med Chem 41: 5457-65 (1998)
Article DOI: 10.1021/jm9804681
BindingDB Entry DOI: 10.7270/Q24T6GJC
Platelet-derived growth factor receptor beta
(Homo sapiens (Human))
BDBM3793
(1-Phenylbenzimidazole deriv. 10 | 1-phenyl-1H-1,2,...)
Show SMILES c1ccc(cc1)-n1nnc2ccccc12
Show InChI InChI=1S/C12H9N3/c1-2-6-10(7-3-1)15-12-9-5-4-8-11(12)13-14-15/h1-9H
NCI pathway
Reactome pathway
n/an/a>5.00E+4n/an/an/an/a7.425
University of Auckland
Assay Description
IC50 is the inhibitor concentration which inhibits 50% of kinase activity that catalyzes the transfer of the terminal phosphate from [gamma-32P] labe...
J Med Chem 41: 5457-65 (1998)
Article DOI: 10.1021/jm9804681
BindingDB Entry DOI: 10.7270/Q24T6GJC