BDBM3795 1-(2-methylphenyl)-1H-1,3-benzodiazole::1-Phenylbenzimidazole deriv. 12
SMILES: Cc1ccccc1-n1cnc2ccccc12
InChI Key: InChIKey=INTQXBADEIVKGD-UHFFFAOYSA-N
Data: 2 IC50
Activity Spreadsheet -- Enzyme Inhibition Constant Data from BindingDB
Found 2 hits for monomerid = 3795
Trg + Lig
Ki
nM
ΔG°
kcal/mole
IC50
nM
Kd
nM
EC50/IC50
nM
koff
s-1
kon
M-1s-1
pHTemp
°C
Fibroblast growth factor receptor 1
(Homo sapiens (Human))
BDBM3795
(1-(2-methylphenyl)-1H-1,3-benzodiazole | 1-Phenylb...)
Show SMILES Cc1ccccc1-n1cnc2ccccc12
Show InChI InChI=1S/C14H12N2/c1-11-6-2-4-8-13(11)16-10-15-12-7-3-5-9-14(12)16/h2-10H,1H3
NCI pathway
Reactome pathway
n/an/a>5.00E+4n/an/an/an/a7.425
University of Auckland
Assay Description
IC50 is the inhibitor concentration which inhibits 50% of kinase activity that catalyzes the transfer of the terminal phosphate from [gamma-32P] labe...
J Med Chem 41: 5457-65 (1998)
Article DOI: 10.1021/jm9804681
BindingDB Entry DOI: 10.7270/Q24T6GJC
Platelet-derived growth factor receptor beta
(Homo sapiens (Human))
BDBM3795
(1-(2-methylphenyl)-1H-1,3-benzodiazole | 1-Phenylb...)
Show SMILES Cc1ccccc1-n1cnc2ccccc12
Show InChI InChI=1S/C14H12N2/c1-11-6-2-4-8-13(11)16-10-15-12-7-3-5-9-14(12)16/h2-10H,1H3
NCI pathway
Reactome pathway
n/an/a>5.00E+4n/an/an/an/a7.425
University of Auckland
Assay Description
IC50 is the inhibitor concentration which inhibits 50% of kinase activity that catalyzes the transfer of the terminal phosphate from [gamma-32P] labe...
J Med Chem 41: 5457-65 (1998)
Article DOI: 10.1021/jm9804681
BindingDB Entry DOI: 10.7270/Q24T6GJC