BDBM3809 1-(3-methoxyphenyl)-1H-1,3-benzodiazole::1-Phenylbenzimidazole deriv. 26
SMILES: COc1cccc(c1)-n1cnc2ccccc12
InChI Key: InChIKey=GJRZGOJCEUSPLX-UHFFFAOYSA-N
Data: 2 IC50
Activity Spreadsheet -- Enzyme Inhibition Constant Data from BindingDB
Found 2 hits for monomerid = 3809
Trg + Lig
Ki
nM
ΔG°
kcal/mole
IC50
nM
Kd
nM
EC50/IC50
nM
koff
s-1
kon
M-1s-1
pHTemp
°C
Fibroblast growth factor receptor 1
(Homo sapiens (Human))
BDBM3809
(1-(3-methoxyphenyl)-1H-1,3-benzodiazole | 1-Phenyl...)
Show SMILES COc1cccc(c1)-n1cnc2ccccc12
Show InChI InChI=1S/C14H12N2O/c1-17-12-6-4-5-11(9-12)16-10-15-13-7-2-3-8-14(13)16/h2-10H,1H3
NCI pathway
Reactome pathway
n/an/a 5.00E+4n/an/an/an/an/an/a
University of Auckland
Assay Description
IC50 is the inhibitor concentration which inhibits 50% of kinase activity that catalyzes the transfer of the terminal phosphate from [gamma-32P] labe...
J Med Chem 41: 5457-65 (1998)
Article DOI: 10.1021/jm9804681
BindingDB Entry DOI: 10.7270/Q24T6GJC
Platelet-derived growth factor receptor beta
(Homo sapiens (Human))
BDBM3809
(1-(3-methoxyphenyl)-1H-1,3-benzodiazole | 1-Phenyl...)
Show SMILES COc1cccc(c1)-n1cnc2ccccc12
Show InChI InChI=1S/C14H12N2O/c1-17-12-6-4-5-11(9-12)16-10-15-13-7-2-3-8-14(13)16/h2-10H,1H3
NCI pathway
Reactome pathway
n/an/a 2.50E+4n/an/an/an/an/an/a
University of Auckland
Assay Description
IC50 is the inhibitor concentration which inhibits 50% of kinase activity that catalyzes the transfer of the terminal phosphate from [gamma-32P] labe...
J Med Chem 41: 5457-65 (1998)
Article DOI: 10.1021/jm9804681
BindingDB Entry DOI: 10.7270/Q24T6GJC