BDBM3812 1-Phenylbenzimidazole deriv. 29::3-(1H-1,3-benzodiazol-1-yl)benzoic acid
SMILES: OC(=O)c1cccc(c1)-n1cnc2ccccc12
InChI Key: InChIKey=JGRMSAIUGUVHHM-UHFFFAOYSA-N
Data: 2 IC50
Activity Spreadsheet -- Enzyme Inhibition Constant Data from BindingDB
Found 2 hits for monomerid = 3812
Trg + Lig
Ki
nM
ΔG°
kcal/mole
IC50
nM
Kd
nM
EC50/IC50
nM
koff
s-1
kon
M-1s-1
pHTemp
°C
Fibroblast growth factor receptor 1
(Homo sapiens (Human))
BDBM3812
(1-Phenylbenzimidazole deriv. 29 | 3-(1H-1,3-benzod...)
Show SMILES OC(=O)c1cccc(c1)-n1cnc2ccccc12
Show InChI InChI=1S/C14H10N2O2/c17-14(18)10-4-3-5-11(8-10)16-9-15-12-6-1-2-7-13(12)16/h1-9H,(H,17,18)
NCI pathway
Reactome pathway
n/an/a>5.00E+4n/an/an/an/an/an/a
University of Auckland
Assay Description
IC50 is the inhibitor concentration which inhibits 50% of kinase activity that catalyzes the transfer of the terminal phosphate from [gamma-32P] labe...
J Med Chem 41: 5457-65 (1998)
Article DOI: 10.1021/jm9804681
BindingDB Entry DOI: 10.7270/Q24T6GJC
Platelet-derived growth factor receptor beta
(Homo sapiens (Human))
BDBM3812
(1-Phenylbenzimidazole deriv. 29 | 3-(1H-1,3-benzod...)
Show SMILES OC(=O)c1cccc(c1)-n1cnc2ccccc12
Show InChI InChI=1S/C14H10N2O2/c17-14(18)10-4-3-5-11(8-10)16-9-15-12-6-1-2-7-13(12)16/h1-9H,(H,17,18)
NCI pathway
Reactome pathway
n/an/a>5.00E+4n/an/an/an/an/an/a
University of Auckland
Assay Description
IC50 is the inhibitor concentration which inhibits 50% of kinase activity that catalyzes the transfer of the terminal phosphate from [gamma-32P] labe...
J Med Chem 41: 5457-65 (1998)
Article DOI: 10.1021/jm9804681
BindingDB Entry DOI: 10.7270/Q24T6GJC