BDBM38399 4-[1-oxo-2-(1-pyrrolidinyl)ethyl]-9-phenylmethoxy-2,3-dihydro-1H-[1]benzopyrano[3,4-b]pyridin-5-one::9-(benzyloxy)-4-(pyrrolidin-1-ylacetyl)-1,2,3,4-tetrahydro-5H-chromeno[3,4-b]pyridin-5-one::9-benzoxy-4-(2-pyrrolidinoacetyl)-2,3-dihydro-1H-chromeno[3,4-b]pyridin-5-one::9-phenylmethoxy-4-(2-pyrrolidin-1-ylacetyl)-2,3-dihydro-1H-chromeno[3,4-b]pyridin-5-one::9-phenylmethoxy-4-(2-pyrrolidin-1-ylethanoyl)-2,3-dihydro-1H-chromeno[3,4-b]pyridin-5-one::MLS000043268::SMR000019888::cid_3238360
SMILES: O=C(CN1CCCC1)N1CCCc2c1c(=O)oc1ccc(OCc3ccccc3)cc21
InChI Key: InChIKey=LDPNMAIEXWXDEO-UHFFFAOYSA-N
Data: 1 IC50
Activity Spreadsheet -- Enzyme Inhibition Constant Data from BindingDB
Found 1 hit for monomerid = 38399
Trg + Lig
Ki
nM
ΔG°
kcal/mole
IC50
nM
Kd
nM
EC50/IC50
nM
koff
s-1
kon
M-1s-1
pHTemp
°C
diphosphomevalonate decarboxylase
(Streptococcus pneumoniae D39)
BDBM38399
(4-[1-oxo-2-(1-pyrrolidinyl)ethyl]-9-phenylmethoxy-...)
Show SMILES O=C(CN1CCCC1)N1CCCc2c1c(=O)oc1ccc(OCc3ccccc3)cc21
Show InChI InChI=1S/C25H26N2O4/c28-23(16-26-12-4-5-13-26)27-14-6-9-20-21-15-19(30-17-18-7-2-1-3-8-18)10-11-22(21)31-25(29)24(20)27/h1-3,7-8,10-11,15H,4-6,9,12-14,16-17H2
PCBioAssay
n/an/a 2.47E+4n/an/an/an/an/an/a
SRMLSC
Curated by PubChem BioAssay
Assay Description
Southern Research Molecular Libraries Screening Center (SRMLSC) Southern Research Institute (Birmingham, Alabama) NIH Molecular Libraries Screening C...
PubChem Bioassay (2007)
BindingDB Entry DOI: 10.7270/Q2N014XN