BDBM384 (3R)-oxolan-3-yl N-[(2S,3S,5R)-5-benzyl-3-hydroxy-5-{[(1S,2R)-2-hydroxy-2,3-dihydro-1H-inden-1-yl]carbamoyl}-1-phenylpentan-2-yl]carbamate::Urethane deriv. 3
SMILES: O[C@@H](C[C@@H](Cc1ccccc1)C(=O)N[C@@H]1[C@H](O)Cc2ccccc12)[C@H](Cc1ccccc1)NC(=O)O[C@@H]1CCOC1
InChI Key: InChIKey=PKJPLBXKJRGYRL-NKBYLQHSSA-N
Data: 1 IC50
Activity Spreadsheet -- Enzyme Inhibition Constant Data from BindingDB
Found 1 hit for monomerid = 384
Trg + Lig
Ki
nM
ΔG°
kcal/mole
IC50
nM
Kd
nM
EC50/IC50
nM
koff
s-1
kon
M-1s-1
pHTemp
°C
HIV-1 Protease
(Human immunodeficiency virus type 1)
BDBM384
((3R)-oxolan-3-yl N-[(2S,3S,5R)-5-benzyl-3-hydroxy-...)
Show SMILES O[C@@H](C[C@@H](Cc1ccccc1)C(=O)N[C@@H]1[C@H](O)Cc2ccccc12)[C@H](Cc1ccccc1)NC(=O)O[C@@H]1CCOC1 |r|
Show InChI InChI=1S/C33H38N2O6/c36-29(28(18-23-11-5-2-6-12-23)34-33(39)41-26-15-16-40-21-26)20-25(17-22-9-3-1-4-10-22)32(38)35-31-27-14-8-7-13-24(27)19-30(31)37/h1-14,25-26,28-31,36-37H,15-21H2,(H,34,39)(H,35,38)/t25-,26-,28+,29+,30-,31+/m1/s1
n/an/a 0.0300n/an/an/an/a5.530
Merck Research Laboratories
Assay Description
Sensitivity of HIV-1 protease activity to protease inhibitors was determined by a peptide substrate cleavage assay. Protease products were analyzed o...
J Med Chem 36: 292-4 (1993)
Article DOI: 10.1021/jm00054a015
BindingDB Entry DOI: 10.7270/Q25D8Q1G