null
SMILES: COC(=O)c1cccc2n(cnc12)-c1ccccc1
InChI Key: InChIKey=DWFIUTDYSFGDMT-UHFFFAOYSA-N
Activity Spreadsheet -- Enzyme Inhibition Constant Data from BindingDB
Found 2 hits for monomerid = 3842
Trg + Lig
Ki
nM
ΔG°
kcal/mole
IC50
nM
Kd
nM
EC50/IC50
nM
koff
s-1
kon
M-1s-1
pHTemp
°C
Fibroblast growth factor receptor 1
(Homo sapiens (Human))
BDBM3842
(1-Phenylbenzimidazole deriv. 59 | Methyl 1-Phenylb...)
Show SMILES COC(=O)c1cccc2n(cnc12)-c1ccccc1
Show InChI InChI=1S/C15H12N2O2/c1-19-15(18)12-8-5-9-13-14(12)16-10-17(13)11-6-3-2-4-7-11/h2-10H,1H3
NCI pathway
Reactome pathway
n/an/a>5.00E+4n/an/an/an/an/an/a
University of Auckland
Assay Description
IC50 is the inhibitor concentration which inhibits 50% of kinase activity that catalyzes the transfer of the terminal phosphate from [gamma-32P] labe...
J Med Chem 41: 5457-65 (1998)
Article DOI: 10.1021/jm9804681
BindingDB Entry DOI: 10.7270/Q24T6GJC
Platelet-derived growth factor receptor beta
(Homo sapiens (Human))
BDBM3842
(1-Phenylbenzimidazole deriv. 59 | Methyl 1-Phenylb...)
Show SMILES COC(=O)c1cccc2n(cnc12)-c1ccccc1
Show InChI InChI=1S/C15H12N2O2/c1-19-15(18)12-8-5-9-13-14(12)16-10-17(13)11-6-3-2-4-7-11/h2-10H,1H3
NCI pathway
Reactome pathway
n/an/a>5.00E+4n/an/an/an/an/an/a
University of Auckland
Assay Description
IC50 is the inhibitor concentration which inhibits 50% of kinase activity that catalyzes the transfer of the terminal phosphate from [gamma-32P] labe...
J Med Chem 41: 5457-65 (1998)
Article DOI: 10.1021/jm9804681
BindingDB Entry DOI: 10.7270/Q24T6GJC