null
SMILES: CC(C)(C)C=C(C#N)C(=O)N1CCC[C@@H]1Cn1c(NC(=O)c2ccc(s2)-c2cnco2)nc2cc(CO)ccc12
InChI Key: InChIKey=MLHBMGYXWLXXSQ-HXUWFJFHSA-N
Activity Spreadsheet -- Enzyme Inhibition Constant Data from BindingDB
Found 2 hits for monomerid = 384381
Trg + Lig
Ki
nM
ΔG°
kcal/mole
IC50
nM
Kd
nM
EC50/IC50
nM
koff
s-1
kon
M-1s-1
pHTemp
°C
Tyrosine-protein kinase TXK
(Homo sapiens (Human))
BDBM384381
((R)-N-(1-((1-(2-cyano-4,4-dimethylpent-2-enoyl)pyr...)
Show SMILES CC(C)(C)C=C(C#N)C(=O)N1CCC[C@@H]1Cn1c(NC(=O)c2ccc(s2)-c2cnco2)nc2cc(CO)ccc12 |r,w:4.3|
Show InChI InChI=1S/C29H30N6O4S/c1-29(2,3)12-19(13-30)27(38)34-10-4-5-20(34)15-35-22-7-6-18(16-36)11-21(22)32-28(35)33-26(37)25-9-8-24(40-25)23-14-31-17-39-23/h6-9,11-12,14,17,20,36H,4-5,10,15-16H2,1-3H3,(H,32,33,37)/t20-/m1/s1
US Patent
n/an/a 1.20n/an/an/an/an/an/a
Universita degli Studi di Firenze
Assay Description
The ability of the compounds of the present disclosure to inhibit ITK was measured using the Caliper assay format, which is an electrophoretic separa...
Bioorg Med Chem Lett 18: 2567-73 (2008)
BindingDB Entry DOI: 10.7270/Q21Z46RF
Tyrosine-protein kinase ITK/TSK
(Homo sapiens (Human))
BDBM384381
((R)-N-(1-((1-(2-cyano-4,4-dimethylpent-2-enoyl)pyr...)
Show SMILES CC(C)(C)C=C(C#N)C(=O)N1CCC[C@@H]1Cn1c(NC(=O)c2ccc(s2)-c2cnco2)nc2cc(CO)ccc12 |r,w:4.3|
Show InChI InChI=1S/C29H30N6O4S/c1-29(2,3)12-19(13-30)27(38)34-10-4-5-20(34)15-35-22-7-6-18(16-36)11-21(22)32-28(35)33-26(37)25-9-8-24(40-25)23-14-31-17-39-23/h6-9,11-12,14,17,20,36H,4-5,10,15-16H2,1-3H3,(H,32,33,37)/t20-/m1/s1
Reactome pathway
US Patent
n/an/a 1.40n/an/an/an/an/an/a
Universita degli Studi di Firenze
Assay Description
The ability of the compounds of the present disclosure to inhibit ITK was measured using the Caliper assay format, which is an electrophoretic separa...
Bioorg Med Chem Lett 18: 2567-73 (2008)
BindingDB Entry DOI: 10.7270/Q21Z46RF