BDBM3847 1-Phenylbenzimidazole deriv. 64::5-Substituted 1-Phenylbenzimidazole 6::5-methoxy-1-phenyl-1H-1,3-benzodiazole
SMILES: COc1ccc2n(cnc2c1)-c1ccccc1
InChI Key: InChIKey=BMNCXCJXZKZJII-UHFFFAOYSA-N
Data: 5 IC50
Activity Spreadsheet -- Enzyme Inhibition Constant Data from BindingDB
Found 5 hits for monomerid = 3847
Trg + Lig
Ki
nM
ΔG°
kcal/mole
IC50
nM
Kd
nM
EC50/IC50
nM
koff
s-1
kon
M-1s-1
pHTemp
°C
Platelet-derived growth factor receptor beta
(Homo sapiens (Human))
BDBM3847
(1-Phenylbenzimidazole deriv. 64 | 5-Substituted 1-...)
Show SMILES COc1ccc2n(cnc2c1)-c1ccccc1
Show InChI InChI=1S/C14H12N2O/c1-17-12-7-8-14-13(9-12)15-10-16(14)11-5-3-2-4-6-11/h2-10H,1H3
NCI pathway
Reactome pathway
n/an/a 430n/an/an/an/an/an/a
University of Auckland
Assay Description
IC50 is the inhibitor concentration which inhibits 50% of kinase activity that catalyzes the transfer of the terminal phosphate from [gamma-32P] labe...
J Med Chem 41: 5457-65 (1998)
Article DOI: 10.1021/jm9804681
BindingDB Entry DOI: 10.7270/Q24T6GJC
Fibroblast growth factor receptor 1
(Homo sapiens (Human))
BDBM3847
(1-Phenylbenzimidazole deriv. 64 | 5-Substituted 1-...)
Show SMILES COc1ccc2n(cnc2c1)-c1ccccc1
Show InChI InChI=1S/C14H12N2O/c1-17-12-7-8-14-13(9-12)15-10-16(14)11-5-3-2-4-6-11/h2-10H,1H3
NCI pathway
Reactome pathway
n/an/a 2.20E+4n/an/an/an/an/an/a
University of Auckland
Assay Description
IC50 is the inhibitor concentration which inhibits 50% of kinase activity that catalyzes the transfer of the terminal phosphate from [gamma-32P] labe...
J Med Chem 41: 5457-65 (1998)
Article DOI: 10.1021/jm9804681
BindingDB Entry DOI: 10.7270/Q24T6GJC
Proto-oncogene tyrosine-protein kinase Src
(Homo sapiens (Human))
BDBM3847
(1-Phenylbenzimidazole deriv. 64 | 5-Substituted 1-...)
Show SMILES COc1ccc2n(cnc2c1)-c1ccccc1
Show InChI InChI=1S/C14H12N2O/c1-17-12-7-8-14-13(9-12)15-10-16(14)11-5-3-2-4-6-11/h2-10H,1H3
n/an/a>5.00E+4n/an/an/an/an/an/a
University of Auckland
Assay Description
IC50 is the inhibitor concentration which inhibits 50% of kinase activity that catalyzes the transfer of the terminal phosphate from [gamma-32P] labe...
J Med Chem 42: 2373-82 (1999)
Article DOI: 10.1021/jm980658b
BindingDB Entry DOI: 10.7270/Q2W957B2
Fibroblast growth factor receptor 1
(Homo sapiens (Human))
BDBM3847
(1-Phenylbenzimidazole deriv. 64 | 5-Substituted 1-...)
Show SMILES COc1ccc2n(cnc2c1)-c1ccccc1
Show InChI InChI=1S/C14H12N2O/c1-17-12-7-8-14-13(9-12)15-10-16(14)11-5-3-2-4-6-11/h2-10H,1H3
NCI pathway
Reactome pathway
n/an/a 2.20E+4n/an/an/an/an/an/a
University of Auckland
Assay Description
IC50 is the inhibitor concentration which inhibits 50% of kinase activity that catalyzes the transfer of the terminal phosphate from [gamma-32P] labe...
J Med Chem 42: 2373-82 (1999)
Article DOI: 10.1021/jm980658b
BindingDB Entry DOI: 10.7270/Q2W957B2
Platelet-derived growth factor receptor beta
(Homo sapiens (Human))
BDBM3847
(1-Phenylbenzimidazole deriv. 64 | 5-Substituted 1-...)
Show SMILES COc1ccc2n(cnc2c1)-c1ccccc1
Show InChI InChI=1S/C14H12N2O/c1-17-12-7-8-14-13(9-12)15-10-16(14)11-5-3-2-4-6-11/h2-10H,1H3
NCI pathway
Reactome pathway
n/an/a 430n/an/an/an/a7.425
University of Auckland
Assay Description
IC50 is the inhibitor concentration which inhibits 50% of kinase activity that catalyzes the transfer of the terminal phosphate from [gamma-32P] labe...
J Med Chem 42: 2373-82 (1999)
Article DOI: 10.1021/jm980658b
BindingDB Entry DOI: 10.7270/Q2W957B2