null
SMILES: [O-][N+](=O)c1ccc2n(cnc2c1)-c1ccccc1
InChI Key: InChIKey=YXIZJJZDLDWOFR-UHFFFAOYSA-N
Activity Spreadsheet -- Enzyme Inhibition Constant Data from BindingDB
Found 2 hits for monomerid = 3853
Trg + Lig
Ki
nM
ΔG°
kcal/mole
IC50
nM
Kd
nM
EC50/IC50
nM
koff
s-1
kon
M-1s-1
pHTemp
°C
Fibroblast growth factor receptor 1
(Homo sapiens (Human))
BDBM3853
(1-Phenylbenzimidazole deriv. 70 | 5-nitro-1-phenyl...)
Show SMILES [O-][N+](=O)c1ccc2n(cnc2c1)-c1ccccc1
Show InChI InChI=1S/C13H9N3O2/c17-16(18)11-6-7-13-12(8-11)14-9-15(13)10-4-2-1-3-5-10/h1-9H
NCI pathway
Reactome pathway
n/an/a>5.00E+4n/an/an/an/an/an/a
University of Auckland
Assay Description
IC50 is the inhibitor concentration which inhibits 50% of kinase activity that catalyzes the transfer of the terminal phosphate from [gamma-32P] labe...
J Med Chem 41: 5457-65 (1998)
Article DOI: 10.1021/jm9804681
BindingDB Entry DOI: 10.7270/Q24T6GJC
Platelet-derived growth factor receptor beta
(Homo sapiens (Human))
BDBM3853
(1-Phenylbenzimidazole deriv. 70 | 5-nitro-1-phenyl...)
Show SMILES [O-][N+](=O)c1ccc2n(cnc2c1)-c1ccccc1
Show InChI InChI=1S/C13H9N3O2/c17-16(18)11-6-7-13-12(8-11)14-9-15(13)10-4-2-1-3-5-10/h1-9H
NCI pathway
Reactome pathway
n/an/a 1.60E+4n/an/an/an/an/an/a
University of Auckland
Assay Description
IC50 is the inhibitor concentration which inhibits 50% of kinase activity that catalyzes the transfer of the terminal phosphate from [gamma-32P] labe...
J Med Chem 41: 5457-65 (1998)
Article DOI: 10.1021/jm9804681
BindingDB Entry DOI: 10.7270/Q24T6GJC