BDBM3863 1-Phenylbenzimidazole deriv. 80::methyl 1-phenyl-1H-1,3-benzodiazole-6-carboxylate
SMILES: COC(=O)c1ccc2ncn(-c3ccccc3)c2c1
InChI Key: InChIKey=RIIGOZIXLFQUIQ-UHFFFAOYSA-N
Data: 2 IC50
Activity Spreadsheet -- Enzyme Inhibition Constant Data from BindingDB
Found 2 hits for monomerid = 3863
Trg + Lig
Ki
nM
ΔG°
kcal/mole
IC50
nM
Kd
nM
EC50/IC50
nM
koff
s-1
kon
M-1s-1
pHTemp
°C
Fibroblast growth factor receptor 1
(Homo sapiens (Human))
BDBM3863
(1-Phenylbenzimidazole deriv. 80 | methyl 1-phenyl-...)
Show SMILES COC(=O)c1ccc2ncn(-c3ccccc3)c2c1
Show InChI InChI=1S/C15H12N2O2/c1-19-15(18)11-7-8-13-14(9-11)17(10-16-13)12-5-3-2-4-6-12/h2-10H,1H3
NCI pathway
Reactome pathway
n/an/a>5.00E+4n/an/an/an/an/an/a
University of Auckland
Assay Description
IC50 is the inhibitor concentration which inhibits 50% of kinase activity that catalyzes the transfer of the terminal phosphate from [gamma-32P] labe...
J Med Chem 41: 5457-65 (1998)
Article DOI: 10.1021/jm9804681
BindingDB Entry DOI: 10.7270/Q24T6GJC
Platelet-derived growth factor receptor beta
(Homo sapiens (Human))
BDBM3863
(1-Phenylbenzimidazole deriv. 80 | methyl 1-phenyl-...)
Show SMILES COC(=O)c1ccc2ncn(-c3ccccc3)c2c1
Show InChI InChI=1S/C15H12N2O2/c1-19-15(18)11-7-8-13-14(9-11)17(10-16-13)12-5-3-2-4-6-12/h2-10H,1H3
NCI pathway
Reactome pathway
n/an/a 1.30E+4n/an/an/an/an/an/a
University of Auckland
Assay Description
IC50 is the inhibitor concentration which inhibits 50% of kinase activity that catalyzes the transfer of the terminal phosphate from [gamma-32P] labe...
J Med Chem 41: 5457-65 (1998)
Article DOI: 10.1021/jm9804681
BindingDB Entry DOI: 10.7270/Q24T6GJC