null
SMILES: CN(C)CCN1CCN(CCn2nc(-c3ccc(C)cc3)c3c(N)ncnc23)CC1
InChI Key: InChIKey=NKTVKMCHRMDFHV-UHFFFAOYSA-N
Activity Spreadsheet -- Enzyme Inhibition Constant Data from BindingDB
Found 14 hits for monomerid = 387840
Trg + Lig
Ki
nM
ΔG°
kcal/mole
IC50
nM
Kd
nM
EC50/IC50
nM
koff
s-1
kon
M-1s-1
pHTemp
°C
Tyrosine-protein kinase ABL1
(Homo sapiens (Human))
BDBM387840
(US10294227, Code 105)
Show SMILES CN(C)CCN1CCN(CCn2nc(-c3ccc(C)cc3)c3c(N)ncnc23)CC1
Show InChI InChI=1S/C22H32N8/c1-17-4-6-18(7-5-17)20-19-21(23)24-16-25-22(19)30(26-20)15-14-29-12-10-28(11-13-29)9-8-27(2)3/h4-7,16H,8-15H2,1-3H3,(H2,23,24,25)
Reactome pathway
US Patent
n/an/a>1.00E+3n/an/an/an/an/an/a
Boehringer Ingelheim Pharmaceuticals Inc.
Assay Description
Compound IC50 values were determined from 10-point, 1:3 dilution curves starting at either 100 μM or 10 μM with 10 μM ATP, by Reaction...
Bioorg Med Chem Lett 19: 773-7 (2009)
BindingDB Entry DOI: 10.7270/Q27D2XFP
Tyrosine-protein kinase Blk
(Homo sapiens (Human))
BDBM387840
(US10294227, Code 105)
Show SMILES CN(C)CCN1CCN(CCn2nc(-c3ccc(C)cc3)c3c(N)ncnc23)CC1
Show InChI InChI=1S/C22H32N8/c1-17-4-6-18(7-5-17)20-19-21(23)24-16-25-22(19)30(26-20)15-14-29-12-10-28(11-13-29)9-8-27(2)3/h4-7,16H,8-15H2,1-3H3,(H2,23,24,25)
Reactome pathway
US Patent
n/an/a>1.00E+3n/an/an/an/an/an/a
Boehringer Ingelheim Pharmaceuticals Inc.
Assay Description
Compound IC50 values were determined from 10-point, 1:3 dilution curves starting at either 100 μM or 10 μM with 10 μM ATP, by Reaction...
Bioorg Med Chem Lett 19: 773-7 (2009)
BindingDB Entry DOI: 10.7270/Q27D2XFP
Tyrosine-protein kinase Fgr
(Homo sapiens (Human))
BDBM387840
(US10294227, Code 105)
Show SMILES CN(C)CCN1CCN(CCn2nc(-c3ccc(C)cc3)c3c(N)ncnc23)CC1
Show InChI InChI=1S/C22H32N8/c1-17-4-6-18(7-5-17)20-19-21(23)24-16-25-22(19)30(26-20)15-14-29-12-10-28(11-13-29)9-8-27(2)3/h4-7,16H,8-15H2,1-3H3,(H2,23,24,25)
US Patent
n/an/a 550n/an/an/an/an/an/a
Boehringer Ingelheim Pharmaceuticals Inc.
Assay Description
Compound IC50 values were determined from 10-point, 1:3 dilution curves starting at either 100 μM or 10 μM with 10 μM ATP, by Reaction...
Bioorg Med Chem Lett 19: 773-7 (2009)
BindingDB Entry DOI: 10.7270/Q27D2XFP
Tyrosine-protein kinase FRK
(Homo sapiens (Human))
BDBM387840
(US10294227, Code 105)
Show SMILES CN(C)CCN1CCN(CCn2nc(-c3ccc(C)cc3)c3c(N)ncnc23)CC1
Show InChI InChI=1S/C22H32N8/c1-17-4-6-18(7-5-17)20-19-21(23)24-16-25-22(19)30(26-20)15-14-29-12-10-28(11-13-29)9-8-27(2)3/h4-7,16H,8-15H2,1-3H3,(H2,23,24,25)
US Patent
n/an/a>1.00E+3n/an/an/an/an/an/a
Boehringer Ingelheim Pharmaceuticals Inc.
Assay Description
Compound IC50 values were determined from 10-point, 1:3 dilution curves starting at either 100 μM or 10 μM with 10 μM ATP, by Reaction...
Bioorg Med Chem Lett 19: 773-7 (2009)
BindingDB Entry DOI: 10.7270/Q27D2XFP
Tyrosine-protein kinase Fyn
(Homo sapiens (Human))
BDBM387840
(US10294227, Code 105)
Show SMILES CN(C)CCN1CCN(CCn2nc(-c3ccc(C)cc3)c3c(N)ncnc23)CC1
Show InChI InChI=1S/C22H32N8/c1-17-4-6-18(7-5-17)20-19-21(23)24-16-25-22(19)30(26-20)15-14-29-12-10-28(11-13-29)9-8-27(2)3/h4-7,16H,8-15H2,1-3H3,(H2,23,24,25)
US Patent
n/an/a 550n/an/an/an/an/an/a
Boehringer Ingelheim Pharmaceuticals Inc.
Assay Description
Compound IC50 values were determined from 10-point, 1:3 dilution curves starting at either 100 μM or 10 μM with 10 μM ATP, by Reaction...
Bioorg Med Chem Lett 19: 773-7 (2009)
BindingDB Entry DOI: 10.7270/Q27D2XFP
Tyrosine-protein kinase HCK
(Homo sapiens (Human))
BDBM387840
(US10294227, Code 105)
Show SMILES CN(C)CCN1CCN(CCn2nc(-c3ccc(C)cc3)c3c(N)ncnc23)CC1
Show InChI InChI=1S/C22H32N8/c1-17-4-6-18(7-5-17)20-19-21(23)24-16-25-22(19)30(26-20)15-14-29-12-10-28(11-13-29)9-8-27(2)3/h4-7,16H,8-15H2,1-3H3,(H2,23,24,25)
Reactome pathway
US Patent
n/an/a>1.00E+3n/an/an/an/an/an/a
Boehringer Ingelheim Pharmaceuticals Inc.
Assay Description
Compound IC50 values were determined from 10-point, 1:3 dilution curves starting at either 100 μM or 10 μM with 10 μM ATP, by Reaction...
Bioorg Med Chem Lett 19: 773-7 (2009)
BindingDB Entry DOI: 10.7270/Q27D2XFP
Tyrosine-protein kinase Yes
(Homo sapiens (Human))
BDBM387840
(US10294227, Code 105)
Show SMILES CN(C)CCN1CCN(CCn2nc(-c3ccc(C)cc3)c3c(N)ncnc23)CC1
Show InChI InChI=1S/C22H32N8/c1-17-4-6-18(7-5-17)20-19-21(23)24-16-25-22(19)30(26-20)15-14-29-12-10-28(11-13-29)9-8-27(2)3/h4-7,16H,8-15H2,1-3H3,(H2,23,24,25)
Reactome pathway
US Patent
n/an/a 550n/an/an/an/an/an/a
Boehringer Ingelheim Pharmaceuticals Inc.
Assay Description
Compound IC50 values were determined from 10-point, 1:3 dilution curves starting at either 100 μM or 10 μM with 10 μM ATP, by Reaction...
Bioorg Med Chem Lett 19: 773-7 (2009)
BindingDB Entry DOI: 10.7270/Q27D2XFP
Tyrosine-protein kinase Lck
(Homo sapiens (Human))
BDBM387840
(US10294227, Code 105)
Show SMILES CN(C)CCN1CCN(CCn2nc(-c3ccc(C)cc3)c3c(N)ncnc23)CC1
Show InChI InChI=1S/C22H32N8/c1-17-4-6-18(7-5-17)20-19-21(23)24-16-25-22(19)30(26-20)15-14-29-12-10-28(11-13-29)9-8-27(2)3/h4-7,16H,8-15H2,1-3H3,(H2,23,24,25)
US Patent
n/an/a>1.00E+3n/an/an/an/an/an/a
Boehringer Ingelheim Pharmaceuticals Inc.
Assay Description
Compound IC50 values were determined from 10-point, 1:3 dilution curves starting at either 100 μM or 10 μM with 10 μM ATP, by Reaction...
Bioorg Med Chem Lett 19: 773-7 (2009)
BindingDB Entry DOI: 10.7270/Q27D2XFP
Tyrosine-protein kinase Lyn
(Homo sapiens (Human))
BDBM387840
(US10294227, Code 105)
Show SMILES CN(C)CCN1CCN(CCn2nc(-c3ccc(C)cc3)c3c(N)ncnc23)CC1
Show InChI InChI=1S/C22H32N8/c1-17-4-6-18(7-5-17)20-19-21(23)24-16-25-22(19)30(26-20)15-14-29-12-10-28(11-13-29)9-8-27(2)3/h4-7,16H,8-15H2,1-3H3,(H2,23,24,25)
Reactome pathway
US Patent
n/an/a 550n/an/an/an/an/an/a
Boehringer Ingelheim Pharmaceuticals Inc.
Assay Description
Compound IC50 values were determined from 10-point, 1:3 dilution curves starting at either 100 μM or 10 μM with 10 μM ATP, by Reaction...
Bioorg Med Chem Lett 19: 773-7 (2009)
BindingDB Entry DOI: 10.7270/Q27D2XFP
Serine/threonine-protein kinase mTOR
(Homo sapiens (Human))
BDBM387840
(US10294227, Code 105)
Show SMILES CN(C)CCN1CCN(CCn2nc(-c3ccc(C)cc3)c3c(N)ncnc23)CC1
Show InChI InChI=1S/C22H32N8/c1-17-4-6-18(7-5-17)20-19-21(23)24-16-25-22(19)30(26-20)15-14-29-12-10-28(11-13-29)9-8-27(2)3/h4-7,16H,8-15H2,1-3H3,(H2,23,24,25)
NCI pathway
Reactome pathway
US Patent
n/an/a>1.00E+3n/an/an/an/an/an/a
Boehringer Ingelheim Pharmaceuticals Inc.
Assay Description
Compound IC50 values were determined from 10-point, 1:3 dilution curves starting at either 100 μM or 10 μM with 10 μM ATP, by Reaction...
Bioorg Med Chem Lett 19: 773-7 (2009)
BindingDB Entry DOI: 10.7270/Q27D2XFP
Platelet-derived growth factor receptor alpha
(Homo sapiens (Human))
BDBM387840
(US10294227, Code 105)
Show SMILES CN(C)CCN1CCN(CCn2nc(-c3ccc(C)cc3)c3c(N)ncnc23)CC1
Show InChI InChI=1S/C22H32N8/c1-17-4-6-18(7-5-17)20-19-21(23)24-16-25-22(19)30(26-20)15-14-29-12-10-28(11-13-29)9-8-27(2)3/h4-7,16H,8-15H2,1-3H3,(H2,23,24,25)
US Patent
n/an/a>1.00E+3n/an/an/an/an/an/a
Boehringer Ingelheim Pharmaceuticals Inc.
Assay Description
Compound IC50 values were determined from 10-point, 1:3 dilution curves starting at either 100 μM or 10 μM with 10 μM ATP, by Reaction...
Bioorg Med Chem Lett 19: 773-7 (2009)
BindingDB Entry DOI: 10.7270/Q27D2XFP
Proto-oncogene tyrosine-protein kinase receptor Ret
(Homo sapiens (Human))
BDBM387840
(US10294227, Code 105)
Show SMILES CN(C)CCN1CCN(CCn2nc(-c3ccc(C)cc3)c3c(N)ncnc23)CC1
Show InChI InChI=1S/C22H32N8/c1-17-4-6-18(7-5-17)20-19-21(23)24-16-25-22(19)30(26-20)15-14-29-12-10-28(11-13-29)9-8-27(2)3/h4-7,16H,8-15H2,1-3H3,(H2,23,24,25)
US Patent
n/an/a>1.00E+3n/an/an/an/an/an/a
Boehringer Ingelheim Pharmaceuticals Inc.
Assay Description
Compound IC50 values were determined from 10-point, 1:3 dilution curves starting at either 100 μM or 10 μM with 10 μM ATP, by Reaction...
Bioorg Med Chem Lett 19: 773-7 (2009)
BindingDB Entry DOI: 10.7270/Q27D2XFP
Proto-oncogene tyrosine-protein kinase Src
(Homo sapiens (Human))
BDBM387840
(US10294227, Code 105)
Show SMILES CN(C)CCN1CCN(CCn2nc(-c3ccc(C)cc3)c3c(N)ncnc23)CC1
Show InChI InChI=1S/C22H32N8/c1-17-4-6-18(7-5-17)20-19-21(23)24-16-25-22(19)30(26-20)15-14-29-12-10-28(11-13-29)9-8-27(2)3/h4-7,16H,8-15H2,1-3H3,(H2,23,24,25)
US Patent
n/an/a 550n/an/an/an/an/an/a
Boehringer Ingelheim Pharmaceuticals Inc.
Assay Description
Compound IC50 values were determined from 10-point, 1:3 dilution curves starting at either 100 μM or 10 μM with 10 μM ATP, by Reaction...
Bioorg Med Chem Lett 19: 773-7 (2009)
BindingDB Entry DOI: 10.7270/Q27D2XFP
Mast/stem cell growth factor receptor Kit
(Homo sapiens (Human))
BDBM387840
(US10294227, Code 105)
Show SMILES CN(C)CCN1CCN(CCn2nc(-c3ccc(C)cc3)c3c(N)ncnc23)CC1
Show InChI InChI=1S/C22H32N8/c1-17-4-6-18(7-5-17)20-19-21(23)24-16-25-22(19)30(26-20)15-14-29-12-10-28(11-13-29)9-8-27(2)3/h4-7,16H,8-15H2,1-3H3,(H2,23,24,25)
US Patent
n/an/a>1.00E+3n/an/an/an/an/an/a
Boehringer Ingelheim Pharmaceuticals Inc.
Assay Description
Compound IC50 values were determined from 10-point, 1:3 dilution curves starting at either 100 μM or 10 μM with 10 μM ATP, by Reaction...
Bioorg Med Chem Lett 19: 773-7 (2009)
BindingDB Entry DOI: 10.7270/Q27D2XFP