BDBM38810 MLS000048822::N-[2-(4,6-dimethyl-2-pyrimidinyl)-5-methyl-3-pyrazolyl]-2-phenylbutanamide::N-[2-(4,6-dimethylpyrimidin-2-yl)-5-methyl-pyrazol-3-yl]-2-phenyl-butanamide::N-[2-(4,6-dimethylpyrimidin-2-yl)-5-methyl-pyrazol-3-yl]-2-phenyl-butyramide::N-[2-(4,6-dimethylpyrimidin-2-yl)-5-methylpyrazol-3-yl]-2-phenylbutanamide::SMR000062440::cid_2999426
SMILES: CCC(C(=O)Nc1cc(C)nn1-c1nc(C)cc(C)n1)c1ccccc1
InChI Key: InChIKey=NDKGJDGBLNNUJH-UHFFFAOYSA-N
Data: 1 IC50  2 EC50
Activity Spreadsheet -- Enzyme Inhibition Constant Data from BindingDB
Found 3 hits for monomerid = 38810
Trg + Lig
Ki
nM
ΔG°
kcal/mole
IC50
nM
Kd
nM
EC50/IC50
nM
koff
s-1
kon
M-1s-1
pHTemp
°C
M-phase inducer phosphatase 2
(Homo sapiens (Human))
BDBM38810
(MLS000048822 | N-[2-(4,6-dimethyl-2-pyrimidinyl)-5...)
Show SMILES CCC(C(=O)Nc1cc(C)nn1-c1nc(C)cc(C)n1)c1ccccc1
Show InChI InChI=1S/C20H23N5O/c1-5-17(16-9-7-6-8-10-16)19(26)23-18-12-15(4)24-25(18)20-21-13(2)11-14(3)22-20/h6-12,17H,5H2,1-4H3,(H,23,26)
Reactome pathway
PCBioAssay
n/an/a>5.00E+4n/an/an/an/an/an/a
University of Pittsburgh Molecular Library Screening Center
Curated by PubChem BioAssay
Assay Description
The Cdc25B Phosphatase HTS dose response confirmation has been developed to confirm actives identified in the Cdc25B HTS AID 368, screened at the Uni...
PubChem Bioassay (2006)
BindingDB Entry DOI: 10.7270/Q2BG2MCP
Ion channel NompC
(Danio rerio)
BDBM38810
(MLS000048822 | N-[2-(4,6-dimethyl-2-pyrimidinyl)-5...)
Show SMILES CCC(C(=O)Nc1cc(C)nn1-c1nc(C)cc(C)n1)c1ccccc1
Show InChI InChI=1S/C20H23N5O/c1-5-17(16-9-7-6-8-10-16)19(26)23-18-12-15(4)24-25(18)20-21-13(2)11-14(3)22-20/h6-12,17H,5H2,1-4H3,(H,23,26)
PCBioAssay
n/an/an/an/a 2.99E+4n/an/an/an/a
The Scripps Research Institute Molecular Screening Center
Curated by PubChem BioAssay
Assay Description
Source (MLPCN Center Name): The Scripps Research Institute Molecular Screening Center (SRIMSC) Center Affiliation: The Scripps Research Institute (TS...
PubChem Bioassay (2009)
BindingDB Entry DOI: 10.7270/Q2Z60MG3
Mucolipin-3
(Homo sapiens (Human))
BDBM38810
(MLS000048822 | N-[2-(4,6-dimethyl-2-pyrimidinyl)-5...)
Show SMILES CCC(C(=O)Nc1cc(C)nn1-c1nc(C)cc(C)n1)c1ccccc1
Show InChI InChI=1S/C20H23N5O/c1-5-17(16-9-7-6-8-10-16)19(26)23-18-12-15(4)24-25(18)20-21-13(2)11-14(3)22-20/h6-12,17H,5H2,1-4H3,(H,23,26)
PCBioAssay
n/an/an/an/a>2.99E+4n/an/an/an/a
The Scripps Research Institute Molecular Screening Center
Curated by PubChem BioAssay
Assay Description
Source (MLPCN Center Name): The Scripps Research Institute Molecular Screening Center (SRIMSC) Center Affiliation: The Scripps Research Institute (TS...
PubChem Bioassay (2009)
BindingDB Entry DOI: 10.7270/Q21834W4