BDBM389 Urethane deriv. 8::tert-butyl N-[(2S,3R)-4-[(4aS,8aS)-3-(tert-butylcarbamoyl)-decahydroisoquinolin-2-yl]-3-hydroxy-1-phenylbutan-2-yl]carbamate
SMILES: [H][C@@]12CCCC[C@]1([H])CN(C[C@@H](O)[C@H](Cc1ccccc1)NC(=O)OC(C)(C)C)C(C2)C(=O)NC(C)(C)C
InChI Key: InChIKey=LYMBPRXTWAXSBF-UETCWDDOSA-N
Data: 1 IC50
Activity Spreadsheet -- Enzyme Inhibition Constant Data from BindingDB
Found 1 hit for monomerid = 389
Trg + Lig
Ki
nM
ΔG°
kcal/mole
IC50
nM
Kd
nM
EC50/IC50
nM
koff
s-1
kon
M-1s-1
pHTemp
°C
HIV-1 Protease
(Human immunodeficiency virus type 1)
BDBM389
(Urethane deriv. 8 | tert-butyl N-[(2S,3R)-4-[(4aS,...)
Show SMILES [H][C@@]12CCCC[C@]1([H])CN(C[C@@H](O)[C@H](Cc1ccccc1)NC(=O)OC(C)(C)C)C(C2)C(=O)NC(C)(C)C |r|
Show InChI InChI=1S/C29H47N3O4/c1-28(2,3)31-26(34)24-17-21-14-10-11-15-22(21)18-32(24)19-25(33)23(16-20-12-8-7-9-13-20)30-27(35)36-29(4,5)6/h7-9,12-13,21-25,33H,10-11,14-19H2,1-6H3,(H,30,35)(H,31,34)/t21-,22+,23-,24?,25+/m0/s1
n/an/a>3.00E+3n/an/an/an/a5.530
Merck Research Laboratories
Assay Description
Sensitivity of HIV-1 protease activity to protease inhibitors was determined by a peptide substrate cleavage assay. Protease products were analyzed o...
J Med Chem 36: 292-4 (1993)
Article DOI: 10.1021/jm00054a015
BindingDB Entry DOI: 10.7270/Q25D8Q1G