BDBM389567 N'-{6-chloro-2-[(E)-2-(4- fluorophenyl)vinyl]quinazolin-4-yl}- N,N-diethylpropane-1,3-diamine::US9951029, 21
SMILES: CCN(CC)CCCNc1nc(\C=C\c2ccc(F)cc2)nc2ccc(Cl)cc12
InChI Key: InChIKey=AFEOYIOQTIXAMX-MDWZMJQESA-N
Data: 2 IC50
Activity Spreadsheet -- Enzyme Inhibition Constant Data from BindingDB
Found 2 hits for monomerid = 389567
Trg + Lig
Ki
nM
ΔG°
kcal/mole
IC50
nM
Kd
nM
EC50/IC50
nM
koff
s-1
kon
M-1s-1
pHTemp
°C
Receptor-type tyrosine-protein kinase FLT3
(Homo sapiens (Human))
BDBM389567
(N'-{6-chloro-2-[(E)-2-(4- fluorophenyl)vinyl]quina...)
Show SMILES CCN(CC)CCCNc1nc(\C=C\c2ccc(F)cc2)nc2ccc(Cl)cc12
Show InChI InChI=1S/C23H26ClFN4/c1-3-29(4-2)15-5-14-26-23-20-16-18(24)9-12-21(20)27-22(28-23)13-8-17-6-10-19(25)11-7-17/h6-13,16H,3-5,14-15H2,1-2H3,(H,26,27,28)/b13-8+
n/an/a 2.56E+3n/an/an/an/an/an/a
Vichem Chemie Research Ltd
Curated by ChEMBL
Assay Description
Inhibition of FLT3 ITD mutant (unknown origin) using TAMRA-Src-tide as substrate measured after 1 hr in presence of ATP at its Km concentration by IM...
Eur J Med Chem 184: (2019)
Article DOI: 10.1016/j.ejmech.2019.111710
Receptor-type tyrosine-protein kinase FLT3
(Homo sapiens (Human))
BDBM389567
(N'-{6-chloro-2-[(E)-2-(4- fluorophenyl)vinyl]quina...)
Show SMILES CCN(CC)CCCNc1nc(\C=C\c2ccc(F)cc2)nc2ccc(Cl)cc12
Show InChI InChI=1S/C23H26ClFN4/c1-3-29(4-2)15-5-14-26-23-20-16-18(24)9-12-21(20)27-22(28-23)13-8-17-6-10-19(25)11-7-17/h6-13,16H,3-5,14-15H2,1-2H3,(H,26,27,28)/b13-8+
US Patent
n/an/a 2.26E+3n/an/an/an/an/an/a
Georgia Institute of Technology
Assay Description
FLT3(ITD) biochemical assays were performed on two different assay system platforms, using TranscreenerŽ ADP Assay FP method (BellBrook Labs, Madison...
J Med Chem 52: 456-68 (2009)
BindingDB Entry DOI: 10.7270/Q2NG4T0S