BDBM389568 N'-{6-fluoro-2-[(E)-2-(4- fluorophenyl)vinyl]quinazolin-4-yl}- N,N-dimethylpropane-1,3-diamine::US9951029, 22
SMILES: CN(C)CCCNc1nc(\C=C\c2ccc(F)cc2)nc2ccc(F)cc12
InChI Key: InChIKey=HKWRHMKLOLVLHT-IZZDOVSWSA-N
Data: 2 IC50
Activity Spreadsheet -- Enzyme Inhibition Constant Data from BindingDB
Found 2 hits for monomerid = 389568
Trg + Lig
Ki
nM
ΔG°
kcal/mole
IC50
nM
Kd
nM
EC50/IC50
nM
koff
s-1
kon
M-1s-1
pHTemp
°C
Receptor-type tyrosine-protein kinase FLT3
(Homo sapiens (Human))
BDBM389568
(N'-{6-fluoro-2-[(E)-2-(4- fluorophenyl)vinyl]quina...)
Show SMILES CN(C)CCCNc1nc(\C=C\c2ccc(F)cc2)nc2ccc(F)cc12
Show InChI InChI=1S/C21H22F2N4/c1-27(2)13-3-12-24-21-18-14-17(23)9-10-19(18)25-20(26-21)11-6-15-4-7-16(22)8-5-15/h4-11,14H,3,12-13H2,1-2H3,(H,24,25,26)/b11-6+
n/an/a 3.59E+3n/an/an/an/an/an/a
Vichem Chemie Research Ltd
Curated by ChEMBL
Assay Description
Inhibition of FLT3 ITD mutant (unknown origin) using TAMRA-Src-tide as substrate measured after 1 hr in presence of ATP at its Km concentration by IM...
Eur J Med Chem 184: (2019)
Article DOI: 10.1016/j.ejmech.2019.111710
Receptor-type tyrosine-protein kinase FLT3
(Homo sapiens (Human))
BDBM389568
(N'-{6-fluoro-2-[(E)-2-(4- fluorophenyl)vinyl]quina...)
Show SMILES CN(C)CCCNc1nc(\C=C\c2ccc(F)cc2)nc2ccc(F)cc12
Show InChI InChI=1S/C21H22F2N4/c1-27(2)13-3-12-24-21-18-14-17(23)9-10-19(18)25-20(26-21)11-6-15-4-7-16(22)8-5-15/h4-11,14H,3,12-13H2,1-2H3,(H,24,25,26)/b11-6+
US Patent
n/an/a 4.20E+3n/an/an/an/an/an/a
Georgia Institute of Technology
Assay Description
FLT3(ITD) biochemical assays were performed on two different assay system platforms, using TranscreenerŽ ADP Assay FP method (BellBrook Labs, Madison...
J Med Chem 52: 456-68 (2009)
BindingDB Entry DOI: 10.7270/Q2NG4T0S