BDBM389584 N,N-diethyl-N'-{2-[(E)-2-(2- thienyl)vinyl]benzo[g]quinazolin-4- yl}propane-1,3-diamine::US9951029, 84
SMILES: CCN(CC)CCCNc1nc(\C=C\c2cccs2)nc2cc3ccccc3cc12
InChI Key: InChIKey=YAZSOVPYRSJABJ-OUKQBFOZSA-N
Data: 2 IC50
Activity Spreadsheet -- Enzyme Inhibition Constant Data from BindingDB
Found 2 hits for monomerid = 389584
Trg + Lig
Ki
nM
ΔG°
kcal/mole
IC50
nM
Kd
nM
EC50/IC50
nM
koff
s-1
kon
M-1s-1
pHTemp
°C
Receptor-type tyrosine-protein kinase FLT3
(Homo sapiens (Human))
BDBM389584
(N,N-diethyl-N'-{2-[(E)-2-(2- thienyl)vinyl]benzo[g...)
Show SMILES CCN(CC)CCCNc1nc(\C=C\c2cccs2)nc2cc3ccccc3cc12
Show InChI InChI=1S/C25H28N4S/c1-3-29(4-2)15-8-14-26-25-22-17-19-9-5-6-10-20(19)18-23(22)27-24(28-25)13-12-21-11-7-16-30-21/h5-7,9-13,16-18H,3-4,8,14-15H2,1-2H3,(H,26,27,28)/b13-12+
n/an/a 2.33E+3n/an/an/an/an/an/a
Vichem Chemie Research Ltd
Curated by ChEMBL
Assay Description
Inhibition of FLT3 ITD mutant (unknown origin) using TAMRA-Src-tide as substrate measured after 1 hr in presence of ATP at its Km concentration by IM...
Eur J Med Chem 184: (2019)
Article DOI: 10.1016/j.ejmech.2019.111710
Receptor-type tyrosine-protein kinase FLT3
(Homo sapiens (Human))
BDBM389584
(N,N-diethyl-N'-{2-[(E)-2-(2- thienyl)vinyl]benzo[g...)
Show SMILES CCN(CC)CCCNc1nc(\C=C\c2cccs2)nc2cc3ccccc3cc12
Show InChI InChI=1S/C25H28N4S/c1-3-29(4-2)15-8-14-26-25-22-17-19-9-5-6-10-20(19)18-23(22)27-24(28-25)13-12-21-11-7-16-30-21/h5-7,9-13,16-18H,3-4,8,14-15H2,1-2H3,(H,26,27,28)/b13-12+
US Patent
n/an/a 2.33E+3n/an/an/an/an/an/a
Georgia Institute of Technology
Assay Description
FLT3(ITD) biochemical assays were performed on two different assay system platforms, using TranscreenerŽ ADP Assay FP method (BellBrook Labs, Madison...
J Med Chem 52: 456-68 (2009)
BindingDB Entry DOI: 10.7270/Q2NG4T0S