BDBM3903 (4R)-4-{[(1S)-1-{[(2S)-1-[(2S,4R)-4-(benzyloxy)-2-{[butyl({[(1S)-1-phenylethyl]carbamoyl})amino]carbamoyl}pyrrolidin-1-yl]-3-methyl-1-oxobutan-2-yl]carbamoyl}-2-methylbutyl]carbamoyl}-4-[(3S)-3-acetamido-3-formamidopropanoic acid]butanoic acid::Azapeptide-based compound 44
SMILES: CCCCN(NC(=O)[C@@H]1C[C@H](CN1C(=O)[C@@H](NC(=O)[C@@H](NC(=O)[C@@H](CCC(O)=O)NC(=O)[C@H](CC(O)=O)NC(C)=O)[C@@H](C)CC)C(C)C)OCc1ccccc1)C(=O)N[C@@H](C)c1ccccc1
InChI Key: InChIKey=MUAGOTOIUSHWFP-VIPNNZIHSA-N
Data: 1 IC50
Activity Spreadsheet -- Enzyme Inhibition Constant Data from BindingDB
Found 1 hit for monomerid = 3903
Trg + Lig
Ki
nM
ΔG°
kcal/mole
IC50
nM
Kd
nM
EC50/IC50
nM
koff
s-1
kon
M-1s-1
pHTemp
°C
HCV NS3-NS4A Serine Proteinase
(Hepatitis C virus)
BDBM3903
((4R)-4-{[(1S)-1-{[(2S)-1-[(2S,4R)-4-(benzyloxy)-2-...)
Show SMILES CCCCN(NC(=O)[C@@H]1C[C@H](CN1C(=O)[C@@H](NC(=O)[C@@H](NC(=O)[C@@H](CCC(O)=O)NC(=O)[C@H](CC(O)=O)NC(C)=O)[C@@H](C)CC)C(C)C)OCc1ccccc1)C(=O)N[C@@H](C)c1ccccc1 |r|
Show InChI InChI=1S/C47H68N8O12/c1-8-10-23-55(47(66)48-30(6)33-19-15-12-16-20-33)53-44(63)37-24-34(67-27-32-17-13-11-14-18-32)26-54(37)46(65)40(28(3)4)51-45(64)41(29(5)9-2)52-42(61)35(21-22-38(57)58)50-43(62)36(25-39(59)60)49-31(7)56/h11-20,28-30,34-37,40-41H,8-10,21-27H2,1-7H3,(H,48,66)(H,49,56)(H,50,62)(H,51,64)(H,52,61)(H,53,63)(H,57,58)(H,59,60)/t29-,30-,34+,35+,36-,37-,40-,41-/m0/s1
n/an/a 99n/an/an/an/an/an/a
Boehringer Ingelheim (Canada) Ltd.
Assay Description
The enzymatic assay was performed in assay buffer containing the enzyme complex (protease and NS4A-derived peptide), substrate DDIVPCSMSYTW/biotin-DD...
J Med Chem 47: 3788-99 (2004)
Article DOI: 10.1021/jm049864b
BindingDB Entry DOI: 10.7270/Q2125QTZ