BDBM3918 5-Ethoxy-1-phenylbenzimidazole Hydrochloride::5-Substituted 1-Phenylbenzimidazole 7::5-ethoxy-1-phenyl-1H-1,3-benzodiazole
SMILES: CCOc1ccc2n(cnc2c1)-c1ccccc1
InChI Key: InChIKey=JFCSRORENGKHOD-UHFFFAOYSA-N
Data: 3 IC50
Activity Spreadsheet -- Enzyme Inhibition Constant Data from BindingDB
Found 3 hits for monomerid = 3918
Trg + Lig
Ki
nM
ΔG°
kcal/mole
IC50
nM
Kd
nM
EC50/IC50
nM
koff
s-1
kon
M-1s-1
pHTemp
°C
Platelet-derived growth factor receptor beta
(Homo sapiens (Human))
BDBM3918
(5-Ethoxy-1-phenylbenzimidazole Hydrochloride | 5-S...)
Show SMILES CCOc1ccc2n(cnc2c1)-c1ccccc1
Show InChI InChI=1S/C15H14N2O/c1-2-18-13-8-9-15-14(10-13)16-11-17(15)12-6-4-3-5-7-12/h3-11H,2H2,1H3
NCI pathway
Reactome pathway
n/an/a 240n/an/an/an/a7.425
University of Auckland
Assay Description
IC50 is the inhibitor concentration which inhibits 50% of kinase activity that catalyzes the transfer of the terminal phosphate from [gamma-32P] labe...
J Med Chem 42: 2373-82 (1999)
Article DOI: 10.1021/jm980658b
BindingDB Entry DOI: 10.7270/Q2W957B2
Proto-oncogene tyrosine-protein kinase Src
(Homo sapiens (Human))
BDBM3918
(5-Ethoxy-1-phenylbenzimidazole Hydrochloride | 5-S...)
Show SMILES CCOc1ccc2n(cnc2c1)-c1ccccc1
Show InChI InChI=1S/C15H14N2O/c1-2-18-13-8-9-15-14(10-13)16-11-17(15)12-6-4-3-5-7-12/h3-11H,2H2,1H3
n/an/a>5.00E+4n/an/an/an/an/an/a
University of Auckland
Assay Description
IC50 is the inhibitor concentration which inhibits 50% of kinase activity that catalyzes the transfer of the terminal phosphate from [gamma-32P] labe...
J Med Chem 42: 2373-82 (1999)
Article DOI: 10.1021/jm980658b
BindingDB Entry DOI: 10.7270/Q2W957B2
Fibroblast growth factor receptor 1
(Homo sapiens (Human))
BDBM3918
(5-Ethoxy-1-phenylbenzimidazole Hydrochloride | 5-S...)
Show SMILES CCOc1ccc2n(cnc2c1)-c1ccccc1
Show InChI InChI=1S/C15H14N2O/c1-2-18-13-8-9-15-14(10-13)16-11-17(15)12-6-4-3-5-7-12/h3-11H,2H2,1H3
NCI pathway
Reactome pathway
n/an/a 2.60E+4n/an/an/an/an/an/a
University of Auckland
Assay Description
IC50 is the inhibitor concentration which inhibits 50% of kinase activity that catalyzes the transfer of the terminal phosphate from [gamma-32P] labe...
J Med Chem 42: 2373-82 (1999)
Article DOI: 10.1021/jm980658b
BindingDB Entry DOI: 10.7270/Q2W957B2