BDBM392829 US10301306, Example 27
SMILES: Fc1ccc(cc1)-c1c2c(CCNC2=O)n(Cc2ccc(F)cc2C#N)c1-c1ccncc1F
InChI Key: InChIKey=XXNUFZILKLYNLB-UHFFFAOYSA-N
Data: 1 IC50
Activity Spreadsheet -- Enzyme Inhibition Constant Data from BindingDB
Found 1 hit for monomerid = 392829
Trg + Lig
Ki
nM
ΔG°
kcal/mole
IC50
nM
Kd
nM
EC50/IC50
nM
koff
s-1
kon
M-1s-1
pHTemp
°C
Receptor-interacting serine/threonine-protein kinase 3
(Homo sapiens (Human))
BDBM392829
(US10301306, Example 27)
Show SMILES Fc1ccc(cc1)-c1c2c(CCNC2=O)n(Cc2ccc(F)cc2C#N)c1-c1ccncc1F |(-1.25,7.14,;-.85,5.66,;.63,5.26,;1.03,3.77,;-.06,2.68,;-1.54,3.08,;-1.94,4.57,;.34,1.19,;1.81,.72,;1.81,-.82,;3.14,-1.59,;4.47,-.82,;4.47,.72,;3.14,1.49,;3.14,3.03,;.34,-1.3,;-.06,-2.79,;1.03,-3.88,;2.52,-3.48,;3.61,-4.57,;3.21,-6.05,;4.3,-7.14,;1.72,-6.45,;.58,-5.38,;-.91,-5.78,;-2.4,-6.17,;-.56,-.05,;-2.1,-.05,;-2.87,1.28,;-4.41,1.28,;-5.18,-.05,;-4.41,-1.39,;-2.87,-1.39,;-2.1,-2.72,)|
Show InChI InChI=1S/C26H17F3N4O/c27-18-4-1-15(2-5-18)23-24-22(8-10-32-26(24)34)33(25(23)20-7-9-31-13-21(20)29)14-16-3-6-19(28)11-17(16)12-30/h1-7,9,11,13H,8,10,14H2,(H,32,34)
Reactome pathway
US Patent
n/an/a<30n/an/an/an/an/an/a
GSK
Assay Description
The assays were performed in black 1536-well plates. The final assay volume of 2 μl contained a mixture of a fluorescently labeled HTRF probe, T...
Bioorg Med Chem Lett 18: 5018-22 (2008)
BindingDB Entry DOI: 10.7270/Q2M90C19