null
SMILES: Fc1ccc(cc1)-c1c2c(CCNC2=O)n(Cc2c(F)cc(F)cc2F)c1-c1ccncc1
InChI Key: InChIKey=GQMZINMFGFJCFM-UHFFFAOYSA-N
Activity Spreadsheet -- Enzyme Inhibition Constant Data from BindingDB
Found 1 hit for monomerid = 392873
Trg + Lig
Ki
nM
ΔG°
kcal/mole
IC50
nM
Kd
nM
EC50/IC50
nM
koff
s-1
kon
M-1s-1
pHTemp
°C
Receptor-interacting serine/threonine-protein kinase 3
(Homo sapiens (Human))
BDBM392873
(US10301306, Example 71)
Show SMILES Fc1ccc(cc1)-c1c2c(CCNC2=O)n(Cc2c(F)cc(F)cc2F)c1-c1ccncc1
Show InChI InChI=1S/C25H17F4N3O/c26-16-3-1-14(2-4-16)22-23-21(7-10-31-25(23)33)32(24(22)15-5-8-30-9-6-15)13-18-19(28)11-17(27)12-20(18)29/h1-6,8-9,11-12H,7,10,13H2,(H,31,33)
Reactome pathway
US Patent
n/an/a<30n/an/an/an/an/an/a
GSK
Assay Description
The assays were performed in black 1536-well plates. The final assay volume of 2 μl contained a mixture of a fluorescently labeled HTRF probe, T...
Bioorg Med Chem Lett 18: 5018-22 (2008)
BindingDB Entry DOI: 10.7270/Q2M90C19