BDBM392886 US10301306, Example 84
SMILES: Fc1ccc(cc1)-c1c2c(CCNC2=O)n(Cc2c(F)cc(cc2F)C#N)c1-c1ccncc1
InChI Key: InChIKey=OMXYECUWAPVFCT-UHFFFAOYSA-N
Data: 1 IC50
Activity Spreadsheet -- Enzyme Inhibition Constant Data from BindingDB
Found 1 hit for monomerid = 392886
Trg + Lig
Ki
nM
ΔG°
kcal/mole
IC50
nM
Kd
nM
EC50/IC50
nM
koff
s-1
kon
M-1s-1
pHTemp
°C
Receptor-interacting serine/threonine-protein kinase 3
(Homo sapiens (Human))
BDBM392886
(US10301306, Example 84)
Show SMILES Fc1ccc(cc1)-c1c2c(CCNC2=O)n(Cc2c(F)cc(cc2F)C#N)c1-c1ccncc1
Show InChI InChI=1S/C26H17F3N4O/c27-18-3-1-16(2-4-18)23-24-22(7-10-32-26(24)34)33(25(23)17-5-8-31-9-6-17)14-19-20(28)11-15(13-30)12-21(19)29/h1-6,8-9,11-12H,7,10,14H2,(H,32,34)
Reactome pathway
US Patent
n/an/a<30n/an/an/an/an/an/a
GSK
Assay Description
The assays were performed in black 1536-well plates. The final assay volume of 2 μl contained a mixture of a fluorescently labeled HTRF probe, T...
Bioorg Med Chem Lett 18: 5018-22 (2008)
BindingDB Entry DOI: 10.7270/Q2M90C19