BDBM3929 5-Substituted 1-Phenylbenzimidazole 18::5-[4-(N,N-Dimethylamino)butoxy]-1-phenylbenzimidazole Dihydrochloride::dimethyl({4-[(1-phenyl-1H-1,3-benzodiazol-5-yl)oxy]butyl})amine
SMILES: CN(C)CCCCOc1ccc2n(cnc2c1)-c1ccccc1
InChI Key: InChIKey=RGNZNEYNFBAXTE-UHFFFAOYSA-N
Data: 3 IC50
Activity Spreadsheet -- Enzyme Inhibition Constant Data from BindingDB
Found 3 hits for monomerid = 3929
Trg + Lig
Ki
nM
ΔG°
kcal/mole
IC50
nM
Kd
nM
EC50/IC50
nM
koff
s-1
kon
M-1s-1
pHTemp
°C
Platelet-derived growth factor receptor beta
(Homo sapiens (Human))
BDBM3929
(5-Substituted 1-Phenylbenzimidazole 18 | 5-[4-(N,N...)
Show SMILES CN(C)CCCCOc1ccc2n(cnc2c1)-c1ccccc1
Show InChI InChI=1S/C19H23N3O/c1-21(2)12-6-7-13-23-17-10-11-19-18(14-17)20-15-22(19)16-8-4-3-5-9-16/h3-5,8-11,14-15H,6-7,12-13H2,1-2H3
NCI pathway
Reactome pathway
n/an/a 160n/an/an/an/a7.425
University of Auckland
Assay Description
IC50 is the inhibitor concentration which inhibits 50% of kinase activity that catalyzes the transfer of the terminal phosphate from [gamma-32P] labe...
J Med Chem 42: 2373-82 (1999)
Article DOI: 10.1021/jm980658b
BindingDB Entry DOI: 10.7270/Q2W957B2
Proto-oncogene tyrosine-protein kinase Src
(Homo sapiens (Human))
BDBM3929
(5-Substituted 1-Phenylbenzimidazole 18 | 5-[4-(N,N...)
Show SMILES CN(C)CCCCOc1ccc2n(cnc2c1)-c1ccccc1
Show InChI InChI=1S/C19H23N3O/c1-21(2)12-6-7-13-23-17-10-11-19-18(14-17)20-15-22(19)16-8-4-3-5-9-16/h3-5,8-11,14-15H,6-7,12-13H2,1-2H3
n/an/a 5.00E+4n/an/an/an/an/an/a
University of Auckland
Assay Description
IC50 is the inhibitor concentration which inhibits 50% of kinase activity that catalyzes the transfer of the terminal phosphate from [gamma-32P] labe...
J Med Chem 42: 2373-82 (1999)
Article DOI: 10.1021/jm980658b
BindingDB Entry DOI: 10.7270/Q2W957B2
Fibroblast growth factor receptor 1
(Homo sapiens (Human))
BDBM3929
(5-Substituted 1-Phenylbenzimidazole 18 | 5-[4-(N,N...)
Show SMILES CN(C)CCCCOc1ccc2n(cnc2c1)-c1ccccc1
Show InChI InChI=1S/C19H23N3O/c1-21(2)12-6-7-13-23-17-10-11-19-18(14-17)20-15-22(19)16-8-4-3-5-9-16/h3-5,8-11,14-15H,6-7,12-13H2,1-2H3
NCI pathway
Reactome pathway
n/an/a 6.80E+3n/an/an/an/an/an/a
University of Auckland
Assay Description
IC50 is the inhibitor concentration which inhibits 50% of kinase activity that catalyzes the transfer of the terminal phosphate from [gamma-32P] labe...
J Med Chem 42: 2373-82 (1999)
Article DOI: 10.1021/jm980658b
BindingDB Entry DOI: 10.7270/Q2W957B2