null
SMILES: Cc1csc(c1)-c1c2c(CCNC2=O)n(Cc2ccc(F)cc2C#N)c1-c1ccncc1
InChI Key: InChIKey=UJOCMZLADLUFGD-UHFFFAOYSA-N
Activity Spreadsheet -- Enzyme Inhibition Constant Data from BindingDB
Found 1 hit for monomerid = 392944
Trg + Lig
Ki
nM
ΔG°
kcal/mole
IC50
nM
Kd
nM
EC50/IC50
nM
koff
s-1
kon
M-1s-1
pHTemp
°C
Receptor-interacting serine/threonine-protein kinase 3
(Homo sapiens (Human))
BDBM392944
(US10301306, Example 142)
Show SMILES Cc1csc(c1)-c1c2c(CCNC2=O)n(Cc2ccc(F)cc2C#N)c1-c1ccncc1
Show InChI InChI=1S/C25H19FN4OS/c1-15-10-21(32-14-15)23-22-20(6-9-29-25(22)31)30(24(23)16-4-7-28-8-5-16)13-17-2-3-19(26)11-18(17)12-27/h2-5,7-8,10-11,14H,6,9,13H2,1H3,(H,29,31)
Reactome pathway
US Patent
n/an/a<30n/an/an/an/an/an/a
GSK
Assay Description
The assays were performed in black 1536-well plates. The final assay volume of 2 μl contained a mixture of a fluorescently labeled HTRF probe, T...
Bioorg Med Chem Lett 18: 5018-22 (2008)
BindingDB Entry DOI: 10.7270/Q2M90C19