BDBM3932 4-{4-[(1-phenyl-1H-1,3-benzodiazol-5-yl)oxy]butyl}morpholine::5-Substituted 1-Phenylbenzimidazole 21::5-[4-(4-Morpholino)butoxy]-1]phenylbenzimidazole Dihydrochloride
SMILES: C(CCN1CCOCC1)COc1ccc2n(cnc2c1)-c1ccccc1
InChI Key: InChIKey=MMCPIFMHHYLZBY-UHFFFAOYSA-N
Data: 3 IC50
Activity Spreadsheet -- Enzyme Inhibition Constant Data from BindingDB
Found 3 hits for monomerid = 3932
Trg + Lig
Ki
nM
ΔG°
kcal/mole
IC50
nM
Kd
nM
EC50/IC50
nM
koff
s-1
kon
M-1s-1
pHTemp
°C
Platelet-derived growth factor receptor beta
(Homo sapiens (Human))
BDBM3932
(4-{4-[(1-phenyl-1H-1,3-benzodiazol-5-yl)oxy]butyl}...)
Show SMILES C(CCN1CCOCC1)COc1ccc2n(cnc2c1)-c1ccccc1
Show InChI InChI=1S/C21H25N3O2/c1-2-6-18(7-3-1)24-17-22-20-16-19(8-9-21(20)24)26-13-5-4-10-23-11-14-25-15-12-23/h1-3,6-9,16-17H,4-5,10-15H2
NCI pathway
Reactome pathway
n/an/a 270n/an/an/an/a7.425
University of Auckland
Assay Description
IC50 is the inhibitor concentration which inhibits 50% of kinase activity that catalyzes the transfer of the terminal phosphate from [gamma-32P] labe...
J Med Chem 42: 2373-82 (1999)
Article DOI: 10.1021/jm980658b
BindingDB Entry DOI: 10.7270/Q2W957B2
Proto-oncogene tyrosine-protein kinase Src
(Homo sapiens (Human))
BDBM3932
(4-{4-[(1-phenyl-1H-1,3-benzodiazol-5-yl)oxy]butyl}...)
Show SMILES C(CCN1CCOCC1)COc1ccc2n(cnc2c1)-c1ccccc1
Show InChI InChI=1S/C21H25N3O2/c1-2-6-18(7-3-1)24-17-22-20-16-19(8-9-21(20)24)26-13-5-4-10-23-11-14-25-15-12-23/h1-3,6-9,16-17H,4-5,10-15H2
n/an/a 2.50E+4n/an/an/an/an/an/a
University of Auckland
Assay Description
IC50 is the inhibitor concentration which inhibits 50% of kinase activity that catalyzes the transfer of the terminal phosphate from [gamma-32P] labe...
J Med Chem 42: 2373-82 (1999)
Article DOI: 10.1021/jm980658b
BindingDB Entry DOI: 10.7270/Q2W957B2
Fibroblast growth factor receptor 1
(Homo sapiens (Human))
BDBM3932
(4-{4-[(1-phenyl-1H-1,3-benzodiazol-5-yl)oxy]butyl}...)
Show SMILES C(CCN1CCOCC1)COc1ccc2n(cnc2c1)-c1ccccc1
Show InChI InChI=1S/C21H25N3O2/c1-2-6-18(7-3-1)24-17-22-20-16-19(8-9-21(20)24)26-13-5-4-10-23-11-14-25-15-12-23/h1-3,6-9,16-17H,4-5,10-15H2
NCI pathway
Reactome pathway
n/an/a 1.20E+4n/an/an/an/an/an/a
University of Auckland
Assay Description
IC50 is the inhibitor concentration which inhibits 50% of kinase activity that catalyzes the transfer of the terminal phosphate from [gamma-32P] labe...
J Med Chem 42: 2373-82 (1999)
Article DOI: 10.1021/jm980658b
BindingDB Entry DOI: 10.7270/Q2W957B2