BDBM3933 1-(4-Aminophenyl)-5-methoxybenzimidazole Dihydrochloride::4-(5-methoxy-1H-1,3-benzodiazol-1-yl)aniline::5-Substituted 1-Phenylbenzimidazole 22
SMILES: COc1ccc2n(cnc2c1)-c1ccc(N)cc1
InChI Key: InChIKey=KLJLVCKIKCKKEA-UHFFFAOYSA-N
Data: 3 IC50
Activity Spreadsheet -- Enzyme Inhibition Constant Data from BindingDB
Found 3 hits for monomerid = 3933
Trg + Lig
Ki
nM
ΔG°
kcal/mole
IC50
nM
Kd
nM
EC50/IC50
nM
koff
s-1
kon
M-1s-1
pHTemp
°C
Platelet-derived growth factor receptor beta
(Homo sapiens (Human))
BDBM3933
(1-(4-Aminophenyl)-5-methoxybenzimidazole Dihydroch...)
Show SMILES COc1ccc2n(cnc2c1)-c1ccc(N)cc1
Show InChI InChI=1S/C14H13N3O/c1-18-12-6-7-14-13(8-12)16-9-17(14)11-4-2-10(15)3-5-11/h2-9H,15H2,1H3
NCI pathway
Reactome pathway
n/an/a 280n/an/an/an/a7.425
University of Auckland
Assay Description
IC50 is the inhibitor concentration which inhibits 50% of kinase activity that catalyzes the transfer of the terminal phosphate from [gamma-32P] labe...
J Med Chem 42: 2373-82 (1999)
Article DOI: 10.1021/jm980658b
BindingDB Entry DOI: 10.7270/Q2W957B2
Proto-oncogene tyrosine-protein kinase Src
(Homo sapiens (Human))
BDBM3933
(1-(4-Aminophenyl)-5-methoxybenzimidazole Dihydroch...)
Show SMILES COc1ccc2n(cnc2c1)-c1ccc(N)cc1
Show InChI InChI=1S/C14H13N3O/c1-18-12-6-7-14-13(8-12)16-9-17(14)11-4-2-10(15)3-5-11/h2-9H,15H2,1H3
n/an/a>5.00E+4n/an/an/an/an/an/a
University of Auckland
Assay Description
IC50 is the inhibitor concentration which inhibits 50% of kinase activity that catalyzes the transfer of the terminal phosphate from [gamma-32P] labe...
J Med Chem 42: 2373-82 (1999)
Article DOI: 10.1021/jm980658b
BindingDB Entry DOI: 10.7270/Q2W957B2
Fibroblast growth factor receptor 1
(Homo sapiens (Human))
BDBM3933
(1-(4-Aminophenyl)-5-methoxybenzimidazole Dihydroch...)
Show SMILES COc1ccc2n(cnc2c1)-c1ccc(N)cc1
Show InChI InChI=1S/C14H13N3O/c1-18-12-6-7-14-13(8-12)16-9-17(14)11-4-2-10(15)3-5-11/h2-9H,15H2,1H3
NCI pathway
Reactome pathway
n/an/a 1.80E+4n/an/an/an/an/an/a
University of Auckland
Assay Description
IC50 is the inhibitor concentration which inhibits 50% of kinase activity that catalyzes the transfer of the terminal phosphate from [gamma-32P] labe...
J Med Chem 42: 2373-82 (1999)
Article DOI: 10.1021/jm980658b
BindingDB Entry DOI: 10.7270/Q2W957B2