null
SMILES: CC(N1C(=O)C2CC=CCC2C1=O)C(=O)Nc1ncc(C)s1
InChI Key: InChIKey=ZYONOBIFWZONOV-UHFFFAOYSA-N
Activity Spreadsheet -- Enzyme Inhibition Constant Data from BindingDB
Found 1 hit for monomerid = 39384
Trg + Lig
Ki
nM
ΔG°
kcal/mole
IC50
nM
Kd
nM
EC50/IC50
nM
koff
s-1
kon
M-1s-1
pHTemp
°C
Genome polyprotein
(West Nile virus)
BDBM39384
(2-(1,3-diketo-3a,4,7,7a-tetrahydroisoindol-2-yl)-N...)
Show SMILES CC(N1C(=O)C2CC=CCC2C1=O)C(=O)Nc1ncc(C)s1 |c:7|
Show InChI InChI=1S/C15H17N3O3S/c1-8-7-16-15(22-8)17-12(19)9(2)18-13(20)10-5-3-4-6-11(10)14(18)21/h3-4,7,9-11H,5-6H2,1-2H3,(H,16,17,19)
PCBioAssay
n/an/a>5.00E+4n/an/an/an/an/an/a
University of Pittsburgh Molecular Library Screening Center
Curated by PubChem BioAssay
Assay Description
The HTS assay to identify Inhibitors of West Nile Virus (WNV) NS2bNS3 Proteinase was proposed by Dr Alex Strongin of the Burnham Institute XO1-MH0776...
PubChem Bioassay (2007)
BindingDB Entry DOI: 10.7270/Q2222S6W