null
SMILES: Cc1sc2nc3c4ccccc4c(NCc4ccco4)nn3c(=O)c2c1C
InChI Key: InChIKey=ZVKQQLQTBIEXSC-UHFFFAOYSA-N
Activity Spreadsheet -- Enzyme Inhibition Constant Data from BindingDB
Found 1 hit for monomerid = 39386
Trg + Lig
Ki
nM
ΔG°
kcal/mole
IC50
nM
Kd
nM
EC50/IC50
nM
koff
s-1
kon
M-1s-1
pHTemp
°C
Genome polyprotein
(West Nile virus)
BDBM39386
(MLS000056809 | SMR000066381 | cid_1190244)
Show SMILES Cc1sc2nc3c4ccccc4c(NCc4ccco4)nn3c(=O)c2c1C
Show InChI InChI=1S/C20H16N4O2S/c1-11-12(2)27-19-16(11)20(25)24-18(22-19)15-8-4-3-7-14(15)17(23-24)21-10-13-6-5-9-26-13/h3-9H,10H2,1-2H3,(H,21,23)
PCBioAssay
n/an/a>5.00E+4n/an/an/an/an/an/a
University of Pittsburgh Molecular Library Screening Center
Curated by PubChem BioAssay
Assay Description
The HTS assay to identify Inhibitors of West Nile Virus (WNV) NS2bNS3 Proteinase was proposed by Dr Alex Strongin of the Burnham Institute XO1-MH0776...
PubChem Bioassay (2007)
BindingDB Entry DOI: 10.7270/Q2222S6W