null
SMILES: COc1ccc2n(cnc2c1O)-c1ccccc1
InChI Key: InChIKey=BCVANXGROSBZPI-UHFFFAOYSA-N
Activity Spreadsheet -- Enzyme Inhibition Constant Data from BindingDB
Found 3 hits for monomerid = 3939
Trg + Lig
Ki
nM
ΔG°
kcal/mole
IC50
nM
Kd
nM
EC50/IC50
nM
koff
s-1
kon
M-1s-1
pHTemp
°C
Platelet-derived growth factor receptor beta
(Homo sapiens (Human))
BDBM3939
(4-Hydroxy-5-methoxy-1-phenylbenzimidazole | 5-Subs...)
Show SMILES COc1ccc2n(cnc2c1O)-c1ccccc1
Show InChI InChI=1S/C14H12N2O2/c1-18-12-8-7-11-13(14(12)17)15-9-16(11)10-5-3-2-4-6-10/h2-9,17H,1H3
NCI pathway
Reactome pathway
n/an/a 7.10E+3n/an/an/an/an/an/a
University of Auckland
Assay Description
IC50 is the inhibitor concentration which inhibits 50% of kinase activity that catalyzes the transfer of the terminal phosphate from [gamma-32P] labe...
J Med Chem 42: 2373-82 (1999)
Article DOI: 10.1021/jm980658b
BindingDB Entry DOI: 10.7270/Q2W957B2
Proto-oncogene tyrosine-protein kinase Src
(Homo sapiens (Human))
BDBM3939
(4-Hydroxy-5-methoxy-1-phenylbenzimidazole | 5-Subs...)
Show SMILES COc1ccc2n(cnc2c1O)-c1ccccc1
Show InChI InChI=1S/C14H12N2O2/c1-18-12-8-7-11-13(14(12)17)15-9-16(11)10-5-3-2-4-6-10/h2-9,17H,1H3
n/an/a 4.00E+4n/an/an/an/an/an/a
University of Auckland
Assay Description
IC50 is the inhibitor concentration which inhibits 50% of kinase activity that catalyzes the transfer of the terminal phosphate from [gamma-32P] labe...
J Med Chem 42: 2373-82 (1999)
Article DOI: 10.1021/jm980658b
BindingDB Entry DOI: 10.7270/Q2W957B2
Fibroblast growth factor receptor 1
(Homo sapiens (Human))
BDBM3939
(4-Hydroxy-5-methoxy-1-phenylbenzimidazole | 5-Subs...)
Show SMILES COc1ccc2n(cnc2c1O)-c1ccccc1
Show InChI InChI=1S/C14H12N2O2/c1-18-12-8-7-11-13(14(12)17)15-9-16(11)10-5-3-2-4-6-10/h2-9,17H,1H3
NCI pathway
Reactome pathway
n/an/a>5.00E+4n/an/an/an/an/an/a
University of Auckland
Assay Description
IC50 is the inhibitor concentration which inhibits 50% of kinase activity that catalyzes the transfer of the terminal phosphate from [gamma-32P] labe...
J Med Chem 42: 2373-82 (1999)
Article DOI: 10.1021/jm980658b
BindingDB Entry DOI: 10.7270/Q2W957B2