BDBM39391 MLS000094397::N-[2-[4-(4-methoxyphenyl)-1-piperazinyl]-2-(3-pyridinyl)ethyl]carbamic acid phenyl ester::N-[2-[4-(4-methoxyphenyl)piperazino]-2-(3-pyridyl)ethyl]carbamic acid phenyl ester::SMR000016918::cid_3237664::phenyl N-[2-[4-(4-methoxyphenyl)piperazin-1-yl]-2-pyridin-3-yl-ethyl]carbamate::phenyl N-[2-[4-(4-methoxyphenyl)piperazin-1-yl]-2-pyridin-3-ylethyl]carbamate
SMILES: COc1ccc(cc1)N1CCN(CC1)C(CNC(=O)Oc1ccccc1)c1cccnc1
InChI Key: InChIKey=FMGUMOWXLPMYCP-UHFFFAOYSA-N
Data: 1 IC50
Activity Spreadsheet -- Enzyme Inhibition Constant Data from BindingDB
Found 1 hit for monomerid = 39391
Trg + Lig
Ki
nM
ΔG°
kcal/mole
IC50
nM
Kd
nM
EC50/IC50
nM
koff
s-1
kon
M-1s-1
pHTemp
°C
Genome polyprotein
(West Nile virus)
BDBM39391
(MLS000094397 | N-[2-[4-(4-methoxyphenyl)-1-piperaz...)
Show SMILES COc1ccc(cc1)N1CCN(CC1)C(CNC(=O)Oc1ccccc1)c1cccnc1
Show InChI InChI=1S/C25H28N4O3/c1-31-22-11-9-21(10-12-22)28-14-16-29(17-15-28)24(20-6-5-13-26-18-20)19-27-25(30)32-23-7-3-2-4-8-23/h2-13,18,24H,14-17,19H2,1H3,(H,27,30)
PCBioAssay
n/an/a>5.00E+4n/an/an/an/an/an/a
University of Pittsburgh Molecular Library Screening Center
Curated by PubChem BioAssay
Assay Description
The HTS assay to identify Inhibitors of West Nile Virus (WNV) NS2bNS3 Proteinase was proposed by Dr Alex Strongin of the Burnham Institute XO1-MH0776...
PubChem Bioassay (2007)
BindingDB Entry DOI: 10.7270/Q2222S6W