null
SMILES: CC1Cc2c(O1)ccc1n(cnc21)-c1ccccc1
InChI Key: InChIKey=BEJLKCJUYSCJOP-UHFFFAOYSA-N
Activity Spreadsheet -- Enzyme Inhibition Constant Data from BindingDB
Found 3 hits for monomerid = 3945
Trg + Lig
Ki
nM
ΔG°
kcal/mole
IC50
nM
Kd
nM
EC50/IC50
nM
koff
s-1
kon
M-1s-1
pHTemp
°C
Platelet-derived growth factor receptor beta
(Homo sapiens (Human))
BDBM3945
(11-methyl-5-phenyl-10-oxa-3,5-diazatricyclo[7.3.0....)
Show SMILES CC1Cc2c(O1)ccc1n(cnc21)-c1ccccc1
Show InChI InChI=1S/C16H14N2O/c1-11-9-13-15(19-11)8-7-14-16(13)17-10-18(14)12-5-3-2-4-6-12/h2-8,10-11H,9H2,1H3
NCI pathway
Reactome pathway
n/an/a 2.90E+4n/an/an/an/an/an/a
University of Auckland
Assay Description
IC50 is the inhibitor concentration which inhibits 50% of kinase activity that catalyzes the transfer of the terminal phosphate from [gamma-32P] labe...
J Med Chem 42: 2373-82 (1999)
Article DOI: 10.1021/jm980658b
BindingDB Entry DOI: 10.7270/Q2W957B2
Proto-oncogene tyrosine-protein kinase Src
(Homo sapiens (Human))
BDBM3945
(11-methyl-5-phenyl-10-oxa-3,5-diazatricyclo[7.3.0....)
Show SMILES CC1Cc2c(O1)ccc1n(cnc21)-c1ccccc1
Show InChI InChI=1S/C16H14N2O/c1-11-9-13-15(19-11)8-7-14-16(13)17-10-18(14)12-5-3-2-4-6-12/h2-8,10-11H,9H2,1H3
n/an/a>5.00E+4n/an/an/an/an/an/a
University of Auckland
Assay Description
IC50 is the inhibitor concentration which inhibits 50% of kinase activity that catalyzes the transfer of the terminal phosphate from [gamma-32P] labe...
J Med Chem 42: 2373-82 (1999)
Article DOI: 10.1021/jm980658b
BindingDB Entry DOI: 10.7270/Q2W957B2
Fibroblast growth factor receptor 1
(Homo sapiens (Human))
BDBM3945
(11-methyl-5-phenyl-10-oxa-3,5-diazatricyclo[7.3.0....)
Show SMILES CC1Cc2c(O1)ccc1n(cnc21)-c1ccccc1
Show InChI InChI=1S/C16H14N2O/c1-11-9-13-15(19-11)8-7-14-16(13)17-10-18(14)12-5-3-2-4-6-12/h2-8,10-11H,9H2,1H3
NCI pathway
Reactome pathway
n/an/a>5.00E+4n/an/an/an/an/an/a
University of Auckland
Assay Description
IC50 is the inhibitor concentration which inhibits 50% of kinase activity that catalyzes the transfer of the terminal phosphate from [gamma-32P] labe...
J Med Chem 42: 2373-82 (1999)
Article DOI: 10.1021/jm980658b
BindingDB Entry DOI: 10.7270/Q2W957B2